geronimo-dev mailing list archives

Site index · List index
Message view « Date » · « Thread »
Top « Date » · « Thread »
From David Blevins <david.blev...@visi.com>
Subject Re: build failed Mon Nov 1 20:26:50 PST 2004
Date Tue, 02 Nov 2004 02:30:35 GMT
Disregard this failure, it's just me testing to see if the setup is working on a windows box.

Looks good.

-David

On Mon, Nov 01, 2004 at 08:26:50PM -0800, David Blevins wrote:
> 
> ==[SUMMARY]====================================
> 
>     [junit] [ERROR] TEST org.tranql.cache.CacheRowTest FAILED
> 
> ==[UPDATED]====================================
> 
> M src/test/org/tranql/cache/CacheRowTest.java
> 

> Testsuite: org.tranql.cache.CacheRowTest
> Tests run: 2, Failures: 1, Errors: 0, Time elapsed: 0.031 sec
> 
> Testcase: testCacheRow(org.tranql.cache.CacheRowTest):	FAILED
> expected:<Helloo> but was:<Hello>
> junit.framework.AssertionFailedError: expected:<Helloo> but was:<Hello>
> 	at org.tranql.cache.CacheRowTest.testCacheRow(CacheRowTest.java:33)
> 	at sun.reflect.NativeMethodAccessorImpl.invoke0(Native Method)
> 	at sun.reflect.NativeMethodAccessorImpl.invoke(NativeMethodAccessorImpl.java:39)
> 	at sun.reflect.DelegatingMethodAccessorImpl.invoke(DelegatingMethodAccessorImpl.java:25)
> 	at org.apache.commons.jelly.tags.ant.AntTag.doTag(AntTag.java:232)
> 	at org.apache.commons.jelly.impl.TagScript.run(TagScript.java:279)
> 	at org.apache.commons.jelly.impl.ScriptBlock.run(ScriptBlock.java:135)
> 	at org.apache.commons.jelly.TagSupport.invokeBody(TagSupport.java:233)
> 	at org.apache.commons.jelly.tags.core.IfTag.doTag(IfTag.java:88)
> 	at org.apache.commons.jelly.impl.TagScript.run(TagScript.java:279)
> 	at org.apache.commons.jelly.impl.ScriptBlock.run(ScriptBlock.java:135)
> 	at org.apache.maven.jelly.tags.werkz.MavenGoalTag.runBodyTag(MavenGoalTag.java:79)
> 	at org.apache.maven.jelly.tags.werkz.MavenGoalTag$MavenGoalAction.performAction(MavenGoalTag.java:110)
> 	at com.werken.werkz.Goal.fire(Goal.java:639)
> 	at com.werken.werkz.Goal.attain(Goal.java:575)
> 	at com.werken.werkz.Goal.attainPrecursors(Goal.java:488)
> 	at com.werken.werkz.Goal.attain(Goal.java:573)
> 	at com.werken.werkz.Goal.attainPrecursors(Goal.java:488)
> 	at com.werken.werkz.Goal.attain(Goal.java:573)
> 	at com.werken.werkz.WerkzProject.attainGoal(WerkzProject.java:193)
> 	at org.apache.maven.jelly.tags.werkz.MavenAttainGoalTag.doTag(MavenAttainGoalTag.java:127)
> 	at org.apache.commons.jelly.impl.TagScript.run(TagScript.java:279)
> 	at org.apache.commons.jelly.impl.ScriptBlock.run(ScriptBlock.java:135)
> 	at org.apache.maven.jelly.tags.werkz.MavenGoalTag.runBodyTag(MavenGoalTag.java:79)
> 	at org.apache.maven.jelly.tags.werkz.MavenGoalTag$MavenGoalAction.performAction(MavenGoalTag.java:110)
> 	at com.werken.werkz.Goal.fire(Goal.java:639)
> 	at com.werken.werkz.Goal.attain(Goal.java:575)
> 	at com.werken.werkz.WerkzProject.attainGoal(WerkzProject.java:193)
> 	at org.apache.maven.plugin.PluginManager.attainGoals(PluginManager.java:634)
> 	at org.apache.maven.MavenSession.attainGoals(MavenSession.java:266)
> 	at org.apache.maven.cli.App.doMain(App.java:486)
> 	at org.apache.maven.cli.App.main(App.java:1215)
> 	at sun.reflect.NativeMethodAccessorImpl.invoke0(Native Method)
> 	at sun.reflect.NativeMethodAccessorImpl.invoke(NativeMethodAccessorImpl.java:39)
> 	at sun.reflect.DelegatingMethodAccessorImpl.invoke(DelegatingMethodAccessorImpl.java:25)
> 	at com.werken.forehead.Forehead.run(Forehead.java:551)
> 	at com.werken.forehead.Forehead.main(Forehead.java:581)
> 
> 

> cvs server: Updating .
> cvs server: Updating src
> cvs server: Updating src/antlr
> cvs server: Updating src/java
> cvs server: Updating src/java/org
> cvs server: Updating src/java/org/tranql
> cvs server: Updating src/java/org/tranql/cache
> cvs server: Updating src/java/org/tranql/ejb
> cvs server: Updating src/java/org/tranql/field
> cvs server: Updating src/java/org/tranql/identity
> cvs server: Updating src/java/org/tranql/pkgenerator
> cvs server: Updating src/java/org/tranql/ql
> cvs server: Updating src/java/org/tranql/query
> cvs server: Updating src/java/org/tranql/schema
> cvs server: Updating src/java/org/tranql/sql
> cvs server: Updating src/java/org/tranql/sql/jdbc
> cvs server: Updating src/java/org/tranql/sql/jdbc/binding
> cvs server: Updating src/java/org/tranql/sql/sql92
> cvs server: Updating src/test
> cvs server: Updating src/test/org
> cvs server: Updating src/test/org/tranql
> cvs server: Updating src/test/org/tranql/cache
> M src/test/org/tranql/cache/CacheRowTest.java
> cvs server: Updating src/test/org/tranql/ejb
> cvs server: Updating src/test/org/tranql/pkgenerator
> cvs server: Updating src/test/org/tranql/ql
> cvs server: Updating src/test/org/tranql/query
> cvs server: Updating src/test/org/tranql/sql
> cvs server: Updating src/test/org/tranql/sql/jdbc
> cvs server: Updating src/test/org/tranql/sql/sql92
>  __  __
> |  \/  |__ _Apache__ ___
> | |\/| / _` \ V / -_) ' \  ~ intelligent projects ~
> |_|  |_\__,_|\_/\___|_||_|  v. 1.0
> 
> Attempting to download geronimo-spec-ejb-2.1-SNAPSHOT.jar.
> Artifact /geronimo-spec/jars/geronimo-spec-ejb-2.1-SNAPSHOT.jar doesn't exists in remote
repository, but it exists locally
> Attempting to download geronimo-spec-jta-1.0.1B-SNAPSHOT.jar.
> Artifact /geronimo-spec/jars/geronimo-spec-jta-1.0.1B-SNAPSHOT.jar doesn't exists in
remote repository, but it exists locally
> Plugin 'maven-deploy-plugin' in project 'tranql' is not available
> build:start:
> 
> default:
> java:prepare-filesystem:
> 
> java:compile:
> antlr:prepare-filesystem:
> 
> antlr:generate:
> 
>     [echo] Compiling to C:\cygwin\home\dblevins\work\tranql/target/classes
> 
> java:jar-resources:
> 
> test:prepare-filesystem:
> 
> test:test-resources:
> 
> test:compile:
> 
> test:test:
>     [junit] dir attribute ignored if running in the same VM
>     [junit] Running org.tranql.cache.CacheLoadCommandTest
>     [junit] Tests run: 1, Failures: 0, Errors: 0, Time elapsed: 0.109 sec
>     [junit] dir attribute ignored if running in the same VM
>     [junit] Running org.tranql.cache.CacheRowTest
>     [junit] Tests run: 2, Failures: 1, Errors: 0, Time elapsed: 0.031 sec
>     [junit] [ERROR] TEST org.tranql.cache.CacheRowTest FAILED
>     [junit] dir attribute ignored if running in the same VM
>     [junit] Running org.tranql.cache.InTxCacheTest
>     [junit] Tests run: 4, Failures: 0, Errors: 0, Time elapsed: 0.015 sec
>     [junit] dir attribute ignored if running in the same VM
>     [junit] Running org.tranql.ejb.CompoundPKTest
>     [junit] Tests run: 2, Failures: 0, Errors: 0, Time elapsed: 0.031 sec
>     [junit] dir attribute ignored if running in the same VM
>     [junit] Running org.tranql.ejb.EJBITest
>     [junit] Tests run: 10, Failures: 0, Errors: 0, Time elapsed: 0.688 sec
>     [junit] dir attribute ignored if running in the same VM
>     [junit] Running org.tranql.ejb.EJBQL21CompilerTest
>     [junit] Tests run: 4, Failures: 0, Errors: 0, Time elapsed: 0.156 sec
>     [junit] dir attribute ignored if running in the same VM
>     [junit] Running org.tranql.ejb.EJBQL21SyntaxTest
> line 1:1: unexpected token: ?
> line 1:1: unexpected token: ?
>     [junit] Tests run: 7, Failures: 0, Errors: 0, Time elapsed: 0.157 sec
>     [junit] dir attribute ignored if running in the same VM
>     [junit] Running org.tranql.ejb.EJBRelation_10_3_7_3ITest
>     [junit] Tests run: 5, Failures: 0, Errors: 0, Time elapsed: 0.032 sec
>     [junit] dir attribute ignored if running in the same VM
>     [junit] Running org.tranql.ejb.EJBRelation_10_3_7_4ITest
>     [junit] Tests run: 4, Failures: 0, Errors: 0, Time elapsed: 0.047 sec
>     [junit] dir attribute ignored if running in the same VM
>     [junit] Running org.tranql.ejb.EJBRelation_10_3_7_5ITest
>     [junit] Tests run: 2, Failures: 0, Errors: 0, Time elapsed: 0.031 sec
>     [junit] dir attribute ignored if running in the same VM
>     [junit] Running org.tranql.ejb.EJBRelation_10_3_7_6ITest
>     [junit] Tests run: 4, Failures: 0, Errors: 0, Time elapsed: 0.046 sec
>     [junit] dir attribute ignored if running in the same VM
>     [junit] Running org.tranql.ejb.EJBRelation_10_3_7_7ITest
>     [junit] Tests run: 4, Failures: 0, Errors: 0, Time elapsed: 0.031 sec
>     [junit] dir attribute ignored if running in the same VM
>     [junit] Running org.tranql.ejb.EJBTest
>     [junit] Tests run: 3, Failures: 0, Errors: 0, Time elapsed: 0 sec
>     [junit] dir attribute ignored if running in the same VM
>     [junit] Running org.tranql.ejb.ManyToManyCMRTest
>     [junit] Tests run: 3, Failures: 0, Errors: 0, Time elapsed: 0.032 sec
>     [junit] dir attribute ignored if running in the same VM
>     [junit] Running org.tranql.ejb.ManyToOneCMRTest
>     [junit] Tests run: 4, Failures: 0, Errors: 0, Time elapsed: 0.032 sec
>     [junit] dir attribute ignored if running in the same VM
>     [junit] Running org.tranql.ejb.MultiValuedCMPAccessorTest
>     [junit] Tests run: 24, Failures: 0, Errors: 0, Time elapsed: 0.031 sec
>     [junit] dir attribute ignored if running in the same VM
>     [junit] Running org.tranql.ejb.OneToManyCMRTest
>     [junit] Tests run: 4, Failures: 0, Errors: 0, Time elapsed: 0.031 sec
>     [junit] dir attribute ignored if running in the same VM
>     [junit] Running org.tranql.ejb.OneToOneCMRTest
>     [junit] Tests run: 4, Failures: 0, Errors: 0, Time elapsed: 0.031 sec
>     [junit] dir attribute ignored if running in the same VM
>     [junit] Running org.tranql.ejb.SingleValuedCMRITest
>     [junit] Tests run: 11, Failures: 0, Errors: 0, Time elapsed: 0.438 sec
>     [junit] dir attribute ignored if running in the same VM
>     [junit] Running org.tranql.pkgenerator.SequenceTablePrimaryKeyGeneratorTest
>     [junit] Tests run: 5, Failures: 0, Errors: 0, Time elapsed: 0.406 sec
>     [junit] dir attribute ignored if running in the same VM
>     [junit] Running org.tranql.ql.NodeTest
>     [junit] Tests run: 2, Failures: 0, Errors: 0, Time elapsed: 0 sec
>     [junit] dir attribute ignored if running in the same VM
>     [junit] Running org.tranql.ql.QueryTest
>     [junit] Tests run: 1, Failures: 0, Errors: 0, Time elapsed: 0 sec
>     [junit] dir attribute ignored if running in the same VM
>     [junit] Running org.tranql.query.AssociationEndFaultHandlerBuilderTest
>     [junit] Tests run: 4, Failures: 0, Errors: 0, Time elapsed: 0.063 sec
>     [junit] dir attribute ignored if running in the same VM
>     [junit] Running org.tranql.query.SchemaMapperTest
>     [junit] Tests run: 1, Failures: 0, Errors: 0, Time elapsed: 0.031 sec
>     [junit] dir attribute ignored if running in the same VM
>     [junit] Running org.tranql.sql.EntityReferenceRemoverTest
>     [junit] Tests run: 6, Failures: 0, Errors: 0, Time elapsed: 0.031 sec
>     [junit] dir attribute ignored if running in the same VM
>     [junit] Running org.tranql.sql.jdbc.ConditionalUpdateTest
>     [junit] Tests run: 2, Failures: 0, Errors: 0, Time elapsed: 0.562 sec
>     [junit] dir attribute ignored if running in the same VM
>     [junit] Running org.tranql.sql.jdbc.JDBCQueryCommandTest
>     [junit] Tests run: 4, Failures: 0, Errors: 0, Time elapsed: 0.359 sec
>     [junit] dir attribute ignored if running in the same VM
>     [junit] Running org.tranql.sql.jdbc.JDBCUpdateCommandTest
>     [junit] Tests run: 1, Failures: 0, Errors: 0, Time elapsed: 0.343 sec
>     [junit] dir attribute ignored if running in the same VM
>     [junit] Running org.tranql.sql.jdbc.SQLIdentityGeneratorTest
>     [junit] Tests run: 1, Failures: 0, Errors: 0, Time elapsed: 0.328 sec
>     [junit] dir attribute ignored if running in the same VM
>     [junit] Running org.tranql.sql.sql92.SQL92GeneratorTest
>     [junit] Tests run: 22, Failures: 0, Errors: 0, Time elapsed: 0.047 sec
>     [junit] dir attribute ignored if running in the same VM
>     [junit] Running org.tranql.sql.sql92.SQL92ITest
>     [junit] Tests run: 1, Failures: 0, Errors: 0, Time elapsed: 0.36 sec
>     [junit] dir attribute ignored if running in the same VM
>     [junit] Running org.tranql.sql.sql92.SQL92QueryBuilderTest
>     [junit] Tests run: 1, Failures: 0, Errors: 0, Time elapsed: 0.031 sec
> 
> BUILD FAILED
> File...... C:\Documents and Settings\Default User\.maven\cache\maven-test-plugin-1.6.2\plugin.jelly
> Element... fail
> Line...... 181
> Column.... 54
> There were test failures.
> Total time: 10 seconds
> Finished at: Mon Nov 01 20:26:36 PST 2004
> 

>  __  __
> |  \/  |__ _Apache__ ___
> | |\/| / _` \ V / -_) ' \  ~ intelligent projects ~
> |_|  |_\__,_|\_/\___|_||_|  v. 1.0
> 
> #---- BEGIN: Which report
> Which.version=Which.java:($Revision: 1.2 $) WhichJar.java:($Revision: 1.2 $)
> java.version=1.4.2_06
> file.encoding=Cp1252
> java.ext.dirs=c:\j2sdk1.4.2_06\jre\lib\ext
> java.class.path=c:\Program Files\Apache Software Foundation\Maven 1.0\/lib/forehead-1.0-beta-5.jar
> os.name=Windows 2000
> java.vendor=Sun Microsystems Inc.
> sun.boot.class.path=c:\Program Files\Apache Software Foundation\Maven 1.0\lib\endorsed\xerces-2.4.0.jar;c:\Program
Files\Apache Software Foundation\Maven 1.0\lib\endorsed\xml-apis-1.0.b2.jar;c:\j2sdk1.4.2_06\jre\lib\rt.jar;c:\j2sdk1.4.2_06\jre\lib\i18n.jar;c:\j2sdk1.4.2_06\jre\lib\sunrsasign.jar;c:\j2sdk1.4.2_06\jre\lib\jsse.jar;c:\j2sdk1.4.2_06\jre\lib\jce.jar;c:\j2sdk1.4.2_06\jre\lib\charsets.jar;c:\j2sdk1.4.2_06\jre\classes
> java.runtime.name=Java(TM) 2 Runtime Environment, Standard Edition
> #----   END: Which report
> 
> Installed plugins:
>   geronimo-deployment-plugin-1.0-SNAPSHOT
>   maven-abbot-plugin-1.0
>   maven-announcement-plugin-1.2
>   maven-ant-plugin-1.7
>   maven-antlr-plugin-1.2.1
>   maven-appserver-plugin-2.0
>   maven-artifact-plugin-1.4
>   maven-ashkelon-plugin-1.2
>   maven-aspectj-plugin-3.1.1
>   maven-aspectwerkz-plugin-1.2
>   maven-caller-plugin-1.1
>   maven-castor-plugin-1.2
>   maven-changelog-plugin-1.7.1
>   maven-changes-plugin-1.5
>   maven-checkstyle-plugin-2.4.1
>   maven-clean-plugin-1.3
>   maven-clover-plugin-1.5
>   maven-console-plugin-1.1
>   maven-cruisecontrol-plugin-1.4
>   maven-dashboard-plugin-1.3
>   maven-developer-activity-plugin-1.5
>   maven-dist-plugin-1.6
>   maven-docbook-plugin-1.2
>   maven-ear-plugin-1.5
>   maven-eclipse-plugin-1.7
>   maven-ejb-plugin-1.5
>   maven-faq-plugin-1.4
>   maven-file-activity-plugin-1.5
>   maven-genapp-plugin-2.2
>   maven-gump-plugin-1.4
>   maven-hibernate-plugin-1.1
>   maven-html2xdoc-plugin-1.3
>   maven-idea-plugin-1.5
>   maven-j2ee-plugin-1.5
>   maven-jalopy-plugin-1.3
>   maven-jar-plugin-1.6
>   maven-java-plugin-1.4
>   maven-javacc-plugin-1.1
>   maven-javadoc-plugin-1.6.1
>   maven-jboss-plugin-1.5
>   maven-jbuilder-plugin-1.5
>   maven-jcoverage-plugin-1.0.7
>   maven-jdee-plugin-1.1
>   maven-jdepend-plugin-1.5
>   maven-jdeveloper-plugin-1.4
>   maven-jdiff-plugin-1.4
>   maven-jellydoc-plugin-1.3
>   maven-jetty-plugin-1.1
>   maven-jira-plugin-1.1.1
>   maven-jnlp-plugin-1.4
>   maven-junit-doclet-plugin-1.2
>   maven-junit-report-plugin-1.5
>   maven-jxr-plugin-1.4.1
>   maven-latex-plugin-1.4.1
>   maven-latka-plugin-1.4.1
>   maven-license-plugin-1.2
>   maven-linkcheck-plugin-1.3.2
>   maven-multichanges-plugin-1.1
>   maven-multiproject-plugin-1.3.1
>   maven-native-plugin-1.1
>   maven-nsis-plugin-1.1
>   maven-pdf-plugin-2.1
>   maven-plugin-plugin-1.5.1
>   maven-pmd-plugin-1.5
>   maven-pom-plugin-1.4.1
>   maven-rar-plugin-1.0
>   maven-release-plugin-1.4
>   maven-repository-plugin-1.2
>   maven-scm-plugin-1.4
>   maven-shell-plugin-1.1
>   maven-simian-plugin-1.4
>   maven-site-plugin-1.5.1
>   maven-struts-plugin-1.3
>   maven-tasklist-plugin-2.3
>   maven-test-plugin-1.6.2
>   maven-tjdo-plugin-1.0.0
>   maven-uberjar-plugin-1.2
>   maven-vdoclet-plugin-1.2
>   maven-war-plugin-1.6
>   maven-webserver-plugin-2.0
>   maven-wizard-plugin-1.1
>   maven-xdoc-plugin-1.8
> Exception reading build.properties: C:\Documents and Settings\Default User\build.properties
(The system cannot find the file specified)
> Home Build properties: {}


Mime
View raw message