geronimo-dev mailing list archives

Site index · List index
Message view « Date » · « Thread »
Top « Date » · « Thread »
From David Jencks <djen...@gluecode.com>
Subject Re: build failed Thu Oct 28 12:12:08 PDT 2004
Date Thu, 28 Oct 2004 20:20:13 GMT
oops.  Still don' t think we should get an oom, but I'll back it out

I'm moving that test in a minute, so perhaps letting me do it would be 
advisable.
thanks
david jencks

On Oct 28, 2004, at 1:01 PM, David Blevins wrote:

> On Thu, Oct 28, 2004 at 12:12:09PM -0700, David Blevins wrote:
>>
>> ==[SUMMARY]====================================
>>
>> BUILD FAILED
>>     [junit] [ERROR] TEST org.openejb.slsb.BasicStatelessContainerTest 
>> FAILED
>> BUILD FAILED
>>
>
> Hey David J,
>
> In your commit titled "Refactor jsr-77 naming and restructure
> specification of ref names to parallel jsr-77 " you jacked up the
> count in the BasicStatelessContainerTest.testLocalSpeed method from
> 100,000 to 1,000,000.  Now we are getting an OutOfMemoryError.
>
> -David
>


Mime
View raw message