geronimo-dev mailing list archives

Site index · List index
Message view « Date » · « Thread »
Top « Date » · « Thread »
From David Blevins <david.blev...@visi.com>
Subject Re: build failed Thu Oct 28 12:12:08 PDT 2004
Date Thu, 28 Oct 2004 20:01:47 GMT
On Thu, Oct 28, 2004 at 12:12:09PM -0700, David Blevins wrote:
> 
> ==[SUMMARY]====================================
> 
> BUILD FAILED
>     [junit] [ERROR] TEST org.openejb.slsb.BasicStatelessContainerTest FAILED
> BUILD FAILED
> 

Hey David J, 

In your commit titled "Refactor jsr-77 naming and restructure
specification of ref names to parallel jsr-77 " you jacked up the
count in the BasicStatelessContainerTest.testLocalSpeed method from
100,000 to 1,000,000.  Now we are getting an OutOfMemoryError.

-David

Mime
View raw message