geronimo-dev mailing list archives

Site index · List index
Message view « Date » · « Thread »
Top « Date » · « Thread »
From d..@geronimo.apache.org
Subject [jira] Commented: (GERONIMO-160) Test failure (SocketProtocolStressTest) in network module
Date Fri, 22 Oct 2004 04:59:26 GMT
The following comment has been added to this issue:

     Author: John Sisson
    Created: Thu, 21 Oct 2004 9:59 PM
       Body:
SocketProtocolStressTest fails for me ( I have tried a number of times ) with a TIMEOUT. 
I have attached the network.log FYI.

Testsuite: org.apache.geronimo.network.protocol.SocketProtocolStressTest
Tests run: 3, Failures: 0, Errors: 1, Time elapsed: 61.86 sec

Testcase: testConcurrentRequests(org.apache.geronimo.network.protocol.SocketProtocolStressTest):
Caused an ERROR
TIMEOUT
java.lang.IllegalStateException: TIMEOUT
	at org.apache.geronimo.network.protocol.SocketProtocolStressTest.testConcurrentRequests(SocketProtocolStressTest.java:95)
	at sun.reflect.NativeMethodAccessorImpl.invoke0(Native Method)
	at sun.reflect.NativeMethodAccessorImpl.invoke(NativeMethodAccessorImpl.java:39)
	at sun.reflect.DelegatingMethodAccessorImpl.invoke(DelegatingMethodAccessorImpl.java:25)



---------------------------------------------------------------------
View this comment:
  http://issues.apache.org/jira/browse/GERONIMO-160?page=comments#action_54468

---------------------------------------------------------------------
View the issue:
  http://issues.apache.org/jira/browse/GERONIMO-160

Here is an overview of the issue:
---------------------------------------------------------------------
        Key: GERONIMO-160
    Summary: Test failure (SocketProtocolStressTest) in network module
       Type: Bug

     Status: Reopened
   Priority: Blocker

    Project: Apache Geronimo
 Components: 
             buildsystem

   Assignee: Alan Cabrera
   Reporter: Ralf Barkow

    Created: Sat, 20 Mar 2004 9:44 AM
    Updated: Thu, 21 Oct 2004 9:59 PM
Environment: Windows 2000 Prof. [Version 5.00.2195] SP 4, Java v1.4.2_03-b02

Description:
Component: network

- incubator-geronimo>maven -Dmodules=network

- TEST org.apache.geronimo.network.protocol.SocketProtocolStressTest  
  FAILED

- There may be threading issues cause 
  Testcase: testConcurrentRequests FAILED

    (...)

// assertEquals(WORKERS * MESSAGE_COUNT, count);

expected:<1000> but was:<901>  
junit.framework.AssertionFailedError: expected:<1000> but was:<901>
	at org.apache.geronimo.network.protocol.SocketProtocolStressTest.testConcurrentRequests(SocketProtocolStressTest.java:94)
	at sun.reflect.NativeMethodAccessorImpl.invoke0(Native Method)
	at sun.reflect.NativeMethodAccessorImpl.invoke(NativeMethodAccessorImpl.java:39)
	at sun.reflect.DelegatingMethodAccessorImpl.invoke(DelegatingMethodAccessorImpl.java:25)

Testcase: testConcurrentRequests

- I'd assign this issue to Alan Cabrera.  



---------------------------------------------------------------------
JIRA INFORMATION:
This message is automatically generated by JIRA.

If you think it was sent incorrectly contact one of the administrators:
   http://issues.apache.org/jira/secure/Administrators.jspa

If you want more information on JIRA, or have a bug to report see:
   http://www.atlassian.com/software/jira


Mime
View raw message