geronimo-dev mailing list archives

Site index · List index
Message view « Date » · « Thread »
Top « Date » · « Thread »
From dblev...@apache.org
Subject [status] build: FAILED, test: FAILED | Linux 2.4.26, 2004-09-12
Date Sun, 12 Sep 2004 10:03:04 GMT
NIGHTLY BUILD/TEST
  Date: Sun Sep 12 05:47:31 EDT 2004
  Kernel: Linux 2.4.26
  Host: beaver.codehaus.org
  Java: 1.4.2_04-b05, mixed mode
  Maven: 1.0

CHECKOUT: incubator-geronimo

BUILDING: incubator-geronimo
    [junit] [ERROR] TEST org.apache.geronimo.timer.NontransactionalThreadPooledTimerTest FAILED
BUILD FAILED

BUILD FAILED
Total time: 14 minutes 43 seconds
Finished at: Sun Sep 12 06:03:03 EDT 2004

Mime
View raw message