geronimo-dev mailing list archives

Site index · List index
Message view « Date » · « Thread »
Top « Date » · « Thread »
From dblev...@apache.org
Subject [status] build: FAILED, test: FAILED | Linux 2.4.26, 2004-09-09
Date Thu, 09 Sep 2004 09:57:33 GMT
NIGHTLY BUILD/TEST
  Date: Thu Sep  9 05:44:04 EDT 2004
  Kernel: Linux 2.4.26
  Host: beaver.codehaus.org
  Java: 1.4.2_04-b05, mixed mode
  Maven: 1.0

CHECKOUT: incubator-geronimo

BUILDING: incubator-geronimo
    [junit] [ERROR] TEST org.apache.geronimo.security.bridge.CallerIdentityUserPasswordBridgeTest
FAILED
BUILD FAILED

BUILD FAILED
Total time: 11 minutes 12 seconds
Finished at: Thu Sep 09 05:57:31 EDT 2004

Mime
View raw message