geronimo-dev mailing list archives

Site index · List index
Message view « Date » · « Thread »
Top « Date » · « Thread »
From dblev...@apache.org
Subject [status] build: FAILED, test: FAILED | Linux 2.4.26, 2004-08-11
Date Wed, 11 Aug 2004 09:43:23 GMT
NIGHTLY BUILD/TEST
  Date: Wed Aug 11 05:34:25 EDT 2004
  Kernel: Linux 2.4.26
  Host: beaver.codehaus.org
  Java: 1.4.2_04-b05, mixed mode
  Maven: 1.0

CHECKOUT: incubator-geronimo

BUILDING: incubator-geronimo
    [junit] [ERROR] TEST org.apache.geronimo.network.protocol.SocketProtocolStressTest FAILED
BUILD FAILED

BUILD FAILED
Total time: 7 minutes 50 seconds
Finished at: Wed Aug 11 05:43:23 EDT 2004

Mime
View raw message