geronimo-dev mailing list archives

Site index · List index
Message view « Date » · « Thread »
Top « Date » · « Thread »
From anita kulshreshtha <a_kuls...@yahoo.com>
Subject RE: SocketProtocolStressTest failing
Date Mon, 02 Aug 2004 15:46:30 GMT
Hi Alan
    I checked out latest ControlProtocolTest today.
Here are the results-
test:test:
    [junit] Running
org.apache.geronimo.network.protocol.control.ControlProtocol
Test
    [junit] Tests run: 2, Failures: 0, Errors: 1, Time
elapsed: 16.75 sec
    [junit] [ERROR] TEST
org.apache.geronimo.network.protocol.control.ControlPro
tocolTest FAILED
    [junit] Running
org.apache.geronimo.network.protocol.DatagramProtocolTest
    [junit] Tests run: 2, Failures: 0, Errors: 0, Time
elapsed: 6.92 sec
    [junit] Running
org.apache.geronimo.network.protocol.GSSAPIProtocolTest
    [junit] Tests run: 2, Failures: 0, Errors: 0, Time
elapsed: 0.55 sec
    [junit] Running
org.apache.geronimo.network.protocol.PacketStreamTest
    [junit] Tests run: 3, Failures: 0, Errors: 0, Time
elapsed: 0.61 sec
    [junit] Running
org.apache.geronimo.network.protocol.ProtocolStackTest
    [junit] Tests run: 2, Failures: 0, Errors: 0, Time
elapsed: 6.59 sec
    [junit] Running
org.apache.geronimo.network.protocol.SocketProtocolTest
    [junit] Tests run: 2, Failures: 0, Errors: 0, Time
elapsed: 6.2 sec

BUILD FAILED
File......
C:\WINDOWS\.maven\cache\maven-test-plugin-1.6.2\plugin.jelly
Element... fail
Line...... 181
Column.... 54
There were test failures.
Total time: 48 seconds
Finished at: Mon Aug 02 11:38:31 EDT 2004



              This is from test-reports -
Testsuite:
org.apache.geronimo.network.protocol.control.ControlProtocolTest
Tests run: 2, Failures: 0, Errors: 1, Time elapsed:
16.75 sec

Testcase:
test(org.apache.geronimo.network.protocol.control.ControlProtocolTest):
Caused an ERROR
Send timeout.
org.apache.geronimo.network.protocol.ProtocolException:
Send timeout.
	at
org.apache.geronimo.network.protocol.SocketProtocol.sendDown(SocketProtocol.java:245)
	at
org.apache.geronimo.network.protocol.control.ControlClientProtocol$1.sendDown(ControlClientProtocol.java:142)
	at
org.apache.geronimo.network.protocol.control.ControlClientProtocol.sendDown(ControlClientProtocol.java:77)
	at
org.apache.geronimo.network.protocol.control.ControlClientProtocolKitchen$Dummy.sendDown(ControlClientProtocolKitchen.java:154)
	at
org.apache.geronimo.network.protocol.CountingProtocol.sendDown(CountingProtocol.java:74)
	at
org.apache.geronimo.network.protocol.TestProtocol.sendDown(TestProtocol.java:112)
	at
org.apache.geronimo.network.protocol.ProtocolStack.sendDown(ProtocolStack.java:125)
	at
org.apache.geronimo.network.protocol.control.ControlClientProtocolKitchen.sendDown(ControlClientProtocolKitchen.java:132)
	at
org.apache.geronimo.network.protocol.ProtocolStack.sendDown(ProtocolStack.java:125)
	at
org.apache.geronimo.network.protocol.control.ControlProtocolTest.test(ControlProtocolTest.java:137)
	at
sun.reflect.NativeMethodAccessorImpl.invoke0(Native
Method)
	at
sun.reflect.NativeMethodAccessorImpl.invoke(NativeMethodAccessorImpl.java:39)
	at
sun.reflect.DelegatingMethodAccessorImpl.invoke(DelegatingMethodAccessorImpl.java:25)
                        I hope it helps. Thanks 
                                                      
 Anita
--- "Alan D. Cabrera" <adc@toolazydogs.com> wrote:

> The test controlProtocolTest has been fixed.  Can
> you confirm that this
> has been fixed for you?
> 
> I am working on the SocketProtocolStressTest.
> 
> 
> Regards,
> Alan 
> 
> > -----Original Message-----
> > From: anita kulshreshtha
> [mailto:a_kulshre@yahoo.com]
> > Sent: Sunday, August 01, 2004 7:42 AM
> > To: dev@geronimo.apache.org
> > Subject: Re: SocketProtocolStressTest failing
> > 
> > Hi alan, david
> >     I have never been able to build without
> deleting
> > controlProtocolTest ( gives error) and
> > SocketProtocolStressTest (sometime passes or
> hangs). I
> > am using -
> > windows 98 SE
> > maven-1.0-rc1, maven-1.0
> > java version "1.4.2_01"
> > Java(TM) 2 Runtime Environment, Standard Edition
> > (build 1.4.2_01-b06)
> > Java HotSpot(TM) Client VM (build 1.4.2_01-b06,
> mixed
> > mode)
> >      This issue was raised earlier issue-227.
> >                         TIA
> >                                           Anita
> > 
> > --- David Jencks <david@coredevelopers.net> wrote:
> > 
> > > I'm frequently seeing SocketProtocolStressTest
> > > failures
> > >
> > > mac osx 10.3 1.5 ghz G4
> > >
> > > Anything else I can supply to help?
> > >
> > > thanks
> > > david jencks
> > >
> > > Testsuite:
> > >
> >
>
org.apache.geronimo.network.protocol.SocketProtocolStressTest
> > > Tests run: 3, Failures: 1, Errors: 0, Time
> elapsed:
> > > 78.124 sec
> > >
> > > ------------- Standard Error -----------------
> > >
> >
>
org.apache.geronimo.network.protocol.ProtocolException:
> > > Send timeout.
> > > 	at
> > >
> >
>
org.apache.geronimo.network.protocol.SocketProtocol.sendDown(SocketProto
> > >
> > > col.java:245)
> > > 	at
> > >
> >
>
org.apache.geronimo.network.protocol.SocketProtocolStressTest$1.run(Sock
> > >
> > > etProtocolStressTest.java:80)
> > >
> >
>
org.apache.geronimo.network.protocol.ProtocolException:
> > > Send timeout.
> > > 	at
> > >
> >
>
org.apache.geronimo.network.protocol.SocketProtocol.sendDown(SocketProto
> > >
> > > col.java:245)
> > > 	at
> > >
> >
>
org.apache.geronimo.network.protocol.SocketProtocolStressTest$1.run(Sock
> > >
> > > etProtocolStressTest.java:80)
> > >
> >
>
org.apache.geronimo.network.protocol.ProtocolException:
> > > Send timeout.
> > > 	at
> > >
> >
>
org.apache.geronimo.network.protocol.SocketProtocol.sendDown(SocketProto
> > >
> > > col.java:245)
> > > 	at
> > >
> >
>
org.apache.geronimo.network.protocol.SocketProtocolStressTest$1.run(Sock
> > >
> > > etProtocolStressTest.java:80)
> > >
> >
>
org.apache.geronimo.network.protocol.ProtocolException:
> > > Send timeout.
> > > 	at
> > >
> >
>
org.apache.geronimo.network.protocol.SocketProtocol.sendDown(SocketProto
> > >
> > > col.java:245)
> > > 	at
> > >
> >
>
org.apache.geronimo.network.protocol.SocketProtocolStressTest$1.run(Sock
> > >
> > > etProtocolStressTest.java:80)
> > >
> >
>
org.apache.geronimo.network.protocol.ProtocolException:
> > > Send timeout.
> > > 	at
> > >
> >
>
org.apache.geronimo.network.protocol.SocketProtocol.sendDown(SocketProto
> > >
> > > col.java:245)
> > > 	at
> > >
> >
>
org.apache.geronimo.network.protocol.SocketProtocolStressTest$1.run(Sock
> > >
> > > etProtocolStressTest.java:80)
> > >
> >
>
org.apache.geronimo.network.protocol.ProtocolException:
> > > Send timeout.
> > > 	at
> > >
> >
>
org.apache.geronimo.network.protocol.SocketProtocol.sendDown(SocketProto
> > >
> > > col.java:245)
> > > 	at
> > >
> >
>
org.apache.geronimo.network.protocol.SocketProtocolStressTest$1.run(Sock
> > >
> > > etProtocolStressTest.java:80)
> > >
> >
>
org.apache.geronimo.network.protocol.ProtocolException:
> > > Send timeout.
> > > 	at
> > >
> >
>
org.apache.geronimo.network.protocol.SocketProtocol.sendDown(SocketProto
> > >
> > > col.java:245)
> > > 	at
> > >
> >
>
org.apache.geronimo.network.protocol.SocketProtocolStressTest$1.run(Sock
> > >
> > > etProtocolStressTest.java:80)
> > >
> >
>
org.apache.geronimo.network.protocol.ProtocolException:
> > > Send timeout.
> > > 	at
> > >
> >
>
org.apache.geronimo.network.protocol.SocketProtocol.sendDown(SocketProto
> > >
> > > col.java:245)
> > > 	at
> > >
> >
>
org.apache.geronimo.network.protocol.SocketProtocolStressTest$1.run(Sock
> > >
> > > etProtocolStressTest.java:80)
> > >
> >
>
org.apache.geronimo.network.protocol.ProtocolException:
> > > Send timeout.
> > > 	at
> > >
> >
>
org.apache.geronimo.network.protocol.SocketProtocol.sendDown(SocketProto
> > >
> > > col.java:245)
> > > 	at
> > >
> >
>
org.apache.geronimo.network.protocol.SocketProtocolStressTest$1.run(Sock
> > >
> > > etProtocolStressTest.java:80)
> 
=== message truncated ===



		
__________________________________
Do you Yahoo!?
Read only the mail you want - Yahoo! Mail SpamGuard.
http://promotions.yahoo.com/new_mail 

Mime
View raw message