geronimo-dev mailing list archives

Site index · List index
Message view « Date » · « Thread »
Top « Date » · « Thread »
From Alan Cabrera <Alan.Cabr...@reuters.com>
Subject RE: [status] Windows 2000 - Build for project incubator-geronimo Build Failed
Date Wed, 28 Jul 2004 17:29:55 GMT
I've updated my stress test to be less stressful.  Hopefully this will pass on most machines.


Regards,
Alan

-----Original Message-----
From: Kristian Köhler [mailto:Kristian.Koehler@gmx.de] 
Sent: Wednesday, July 28, 2004 1:27 PM
To: dev@geronimo.apache.org
Subject: Re: [status] Windows 2000 - Build for project incubator-geronimo Build Failed

now it's running with maven 1.0

Kristian

geronimo-builds@oio.de wrote:

> BUILD FAILED
> Ant Error Message: BUILD FAILED detected
...
> test:compile
> [javac] Compiling 9 source files to 
> C:\work\jakarta\incubator-geronimo\modules\network\target\test-classes
> test:test
> [junit] Running 
> org.apache.geronimo.network.protocol.control.ControlProtocolTest
> [junit] Tests run: 2, Failures: 0, Errors: 0, Time elapsed: 13,72 sec
> [junit] Running org.apache.geronimo.network.protocol.DatagramProtocolTest
> [junit] Tests run: 2, Failures: 0, Errors: 0, Time elapsed: 7,621 sec
> [junit] Running org.apache.geronimo.network.protocol.GSSAPIProtocolTest
> [junit] Tests run: 2, Failures: 0, Errors: 0, Time elapsed: 1,021 sec
> [junit] Running org.apache.geronimo.network.protocol.PacketStreamTest
> [junit] Tests run: 3, Failures: 0, Errors: 0, Time elapsed: 1,012 sec
> [junit] Running org.apache.geronimo.network.protocol.ProtocolStackTest
> [junit] Tests run: 2, Failures: 0, Errors: 0, Time elapsed: 6,92 sec
> [junit] Running 
> org.apache.geronimo.network.protocol.SocketProtocolStressTest
> [junit] Tests run: 3, Failures: 1, Errors: 0, Time elapsed: 92,724 sec
> [junit] [ERROR] TEST 
> org.apache.geronimo.network.protocol.SocketProtocolStressTest FAILED
> [junit] Running org.apache.geronimo.network.protocol.SocketProtocolTest
> [junit] Tests run: 2, Failures: 0, Errors: 0, Time elapsed: 6,84 sec
> BUILD FAILED
> File...... c:\work\jakarta\incubator-geronimo\maven.xml
> Element... maven:reactor
> Line...... 180
> Column.... 27
> Unable to obtain goal [default] -- 
> C:\java\maven-1.0\maven_home_local\cache\maven-test-plugin-1.6.2\plugin.jelly:181:54:

> <fail> There were test failures.
> Total time: 8 minutes 30 seconds
> Finished at: Wed Jul 28 19:19:08 CEST 2004



-- 
Kristian Köhler




-----------------------------------------------------------------
        Visit our Internet site at http://www.reuters.com

Get closer to the financial markets with Reuters Messaging - for more
information and to register, visit http://www.reuters.com/messaging

Any views expressed in this message are those of  the  individual
sender,  except  where  the sender specifically states them to be
the views of Reuters Ltd.


Mime
View raw message