geronimo-dev mailing list archives

Site index · List index
Message view « Date » · « Thread »
Top « Date » · « Thread »
From "Alan D. Cabrera" <...@toolazydogs.com>
Subject RE: [ERROR] TEST org.apache.geronimo.axis.EchoHeadersTest FAILED
Date Thu, 29 Jul 2004 02:09:33 GMT
Worked for me on WinXP an hour ago.


Regards,
Alan

> -----Original Message-----
> From: David Blevins [mailto:david.blevins@visi.com]
> Sent: Wednesday, July 28, 2004 9:00 PM
> To: dev@geronimo.apache.org
> Subject: Re: [ERROR] TEST org.apache.geronimo.axis.EchoHeadersTest
FAILED
> 
> On Wed, Jul 28, 2004 at 02:46:22PM -0500, David Blevins wrote:
> > Need to get this fixed today or I'll need to cut it out of the build
> > so we can release.
> 
> Turns out this seems to only fail on windows.  Going to yank this out
> of the build so we can release.  People can still build it by going to
> the axis module and typing 'maven'.
> 
> -David



Mime
View raw message