geronimo-dev mailing list archives

Site index · List index
Message view « Date » · « Thread »
Top « Date » · « Thread »
From dblev...@apache.org
Subject [status] build: FAILED, test: FAILED | Linux 2.4.26, 2004-07-30
Date Fri, 30 Jul 2004 09:44:32 GMT
NIGHTLY BUILD/TEST
  Date: Fri Jul 30 05:30:34 EDT 2004
  Kernel: Linux 2.4.26
  Host: beaver.codehaus.org
  Java: 1.4.2_04-b05, mixed mode
  Maven: 1.0

CHECKOUT: incubator-geronimo

BUILDING: incubator-geronimo
BUILD FAILED

BUILD FAILED
Total time: 13 minutes 3 seconds
Finished at: Fri Jul 30 05:44:32 EDT 2004

Mime
View raw message