geronimo-dev mailing list archives

Site index · List index
Message view « Date » · « Thread »
Top « Date » · « Thread »
From dblev...@apache.org
Subject [status] build: FAILED, test: FAILED | Linux 2.4.26, 2004-07-27
Date Tue, 27 Jul 2004 09:40:25 GMT
NIGHTLY BUILD/TEST
  Date: Tue Jul 27 05:30:45 EDT 2004
  Kernel: Linux 2.4.26
  Host: beaver.codehaus.org
  Java: 1.4.2_04-b05, mixed mode
  Maven: 1.0-rc1-SNAPSHOT

CHECKOUT: incubator-geronimo

BUILDING: incubator-geronimo
    [junit] [ERROR] TEST org.apache.geronimo.network.protocol.SocketProtocolStressTest FAILED
BUILD FAILED

BUILD FAILED
Total time: 7 minutes 51 seconds
Finished at: Tue Jul 27 05:40:23 EDT 2004

Mime
View raw message