geronimo-dev mailing list archives

Site index · List index
Message view « Date » · « Thread »
Top « Date » · « Thread »
From Davanum Srinivas <dava...@gmail.com>
Subject Re: [ERROR] TEST org.apache.geronimo.axis.EchoHeadersTest FAILED
Date Thu, 29 Jul 2004 03:40:36 GMT
That's a problem i have seen in some cases caused by some weird xerces
/ jdk1.4 combinations
(http://www.google.com/search?hl=en&lr=&ie=UTF-8&safe=off&q=%22Converter+malfunction%22+Unicode+&btnG=Search)

-- dims

On Wed, 28 Jul 2004 22:30:46 -0500, David Blevins
<david.blevins@visi.com> wrote:
> On Wed, Jul 28, 2004 at 10:20:53PM -0400, Davanum Srinivas wrote:
> > David,
> >
> > PLEASE post the test case output / stack trace whatever you have...
> 
> SURE, here it is....
> 
> My system info:
>   WinXp
>   CYGWIN_NT-5.1
>   java version "1.4.2_03"
>   Java(TM) 2 Runtime Environment, Standard Edition (build 1.4.2_03-b01)
>   Java HotSpot(TM) Client VM (build 1.4.2_03-b01, mixed mode)
> 
> -David
> 
> 
> 
> >
> > On Wed, 28 Jul 2004 22:09:33 -0400, Alan D. Cabrera <adc@toolazydogs.com>
wrote:
> > > Worked for me on WinXP an hour ago.
> > >
> > > Regards,
> > > Alan
> > >
> > >
> > >
> > > > -----Original Message-----
> > > > From: David Blevins [mailto:david.blevins@visi.com]
> > > > Sent: Wednesday, July 28, 2004 9:00 PM
> > > > To: dev@geronimo.apache.org
> > > > Subject: Re: [ERROR] TEST org.apache.geronimo.axis.EchoHeadersTest
> > > FAILED
> > > >
> > > > On Wed, Jul 28, 2004 at 02:46:22PM -0500, David Blevins wrote:
> > > > > Need to get this fixed today or I'll need to cut it out of the build
> > > > > so we can release.
> > > >
> > > > Turns out this seems to only fail on windows.  Going to yank this out
> > > > of the build so we can release.  People can still build it by going to
> > > > the axis module and typing 'maven'.
> > > >
> > > > -David
> > >
> > >
> >
> >
> > --
> > Davanum Srinivas - http://webservices.apache.org/~dims/
> 
> 
> 


-- 
Davanum Srinivas - http://webservices.apache.org/~dims/

Mime
View raw message