geronimo-dev mailing list archives

Site index · List index
Message view « Date » · « Thread »
Top « Date » · « Thread »
From David Jencks <da...@coredevelopers.net>
Subject Re: [status] build: FAILED, test: FAILED | Linux 2.4.24, 2004-06-20
Date Sun, 20 Jun 2004 16:31:55 GMT
This test passes for me on linux and os X.  How can I find out what the 
problem is?

thanks
david jencks

On Sunday, June 20, 2004, at 02:37 AM, dblevins@apache.org wrote:

> NIGHTLY BUILD/TEST
>   Date: Sun Jun 20 05:30:10 EDT 2004
>   Kernel: Linux 2.4.24
>   Host: beaver.codehaus.org
>   Java: 1.4.2_04-b05, mixed mode
>   Maven: 1.0-rc1-SNAPSHOT
>
> CHECKOUT: incubator-geronimo
>
> BUILDING: incubator-geronimo
>     [junit] [ERROR] TEST 
> org.apache.geronimo.transaction.manager.HOWLLogRecoveryTest FAILED
> BUILD FAILED
>
> BUILD FAILED
> Total time: 7 minutes 16 seconds
> Finished at: Sun Jun 20 05:37:54 EDT 2004
>


Mime
View raw message