geronimo-dev mailing list archives

Site index · List index
Message view « Date » · « Thread »
Top « Date » · « Thread »
From Jacek Laskowski <jlaskow...@apache.org>
Subject Re: [status] build: FAILED, test: FAILED | SunOS 5.8, 2004-06-02
Date Wed, 02 Jun 2004 09:53:25 GMT
dblevins@apache.org wrote:
> NIGHTLY BUILD/TEST
>   Date: Wed Jun  2 01:30:00 PDT 2004
>   Kernel: SunOS 5.8
>   Host: nagoya
>   Java: 1.4.2_04-b05, mixed mode
>   Maven: 1.0-rc1-SNAPSHOT
> 
> CHECKOUT: incubator-geronimo
> 
> BUILDING: incubator-geronimo
> BUILD FAILED
> 
> BUILD FAILED
> Total time: 14 minutes 46 seconds
> Finished at: Wed Jun 02 01:45:32 PDT 2004

Do we know what failed and how to find it out?

Best,
Jacek


Mime
View raw message