geronimo-dev mailing list archives

Site index · List index
Message view « Date » · « Thread »
Top « Date » · « Thread »
From David Blevins <david.blev...@visi.com>
Subject Re: [status] build: FAILED, test: FAILED | Linux 2.4.24, 2004-06-20
Date Mon, 21 Jun 2004 18:58:55 GMT
Yea, here is where the failed builds go.

http://www.apache.org/~dblevins/builds/

Unfortunately, I haven't yet updated the script on beaver so failed
builds there aren't yet uploaded to minotaur.  The rest of them are
there though.

Looking at the results.log for any of those builds to see the maven
output.  Don't be thrown off by the fact that the end of the output
says BUILD SUCCESSFUL; that's just because the tests are run with
-Dmaven.test.failure.ignore=true.

-David

On Sun, Jun 20, 2004 at 09:31:55AM -0700, David Jencks wrote:
> This test passes for me on linux and os X.  How can I find out what the 
> problem is?
> 
> thanks
> david jencks
> 
> On Sunday, June 20, 2004, at 02:37 AM, dblevins@apache.org wrote:
> 
> >NIGHTLY BUILD/TEST
> >  Date: Sun Jun 20 05:30:10 EDT 2004
> >  Kernel: Linux 2.4.24
> >  Host: beaver.codehaus.org
> >  Java: 1.4.2_04-b05, mixed mode
> >  Maven: 1.0-rc1-SNAPSHOT
> >
> >CHECKOUT: incubator-geronimo
> >
> >BUILDING: incubator-geronimo
> >    [junit] [ERROR] TEST 
> >org.apache.geronimo.transaction.manager.HOWLLogRecoveryTest FAILED
> >BUILD FAILED
> >
> >BUILD FAILED
> >Total time: 7 minutes 16 seconds
> >Finished at: Sun Jun 20 05:37:54 EDT 2004
> >

Mime
View raw message