geronimo-dev mailing list archives

Site index · List index
Message view « Date » · « Thread »
Top « Date » · « Thread »
From j...@apache.org
Subject [jira] Commented: (GERONIMO-231) Test cases fail on module/security
Date Wed, 05 May 2004 14:59:56 GMT
The following comment has been added to this issue:

     Author: Alan Cabrera
    Created: Wed, 5 May 2004 7:59 AM
       Body:
Archimedes,

This is highly unusualy that this would happen "out of the box".  Can you explain the steps
that you have taken to reproduce this problem?  Is it possible that you modified something
before running these tests?


Regards,
Alan
---------------------------------------------------------------------
View this comment:
  http://issues.apache.org/jira/browse/GERONIMO-231?page=comments#action_35411

---------------------------------------------------------------------
View the issue:
  http://issues.apache.org/jira/browse/GERONIMO-231

Here is an overview of the issue:
---------------------------------------------------------------------
        Key: GERONIMO-231
    Summary: Test cases fail on module/security
       Type: Bug

     Status: Open
   Priority: Major

    Project: Apache Geronimo
 Components: 
             buildsystem
             security
   Versions:
             1.0-M2

   Assignee: Alan Cabrera
   Reporter: Archimedes Trajano

    Created: Wed, 5 May 2004 7:42 AM
    Updated: Wed, 5 May 2004 7:59 AM
Environment: Windows, Maven (CVS)

Description:
I am trying to do a build of Geronimo using the CVS copy.

I get the following errors

test:test:
    [junit] Running org.apache.geronimo.security.bridge.CallerIdentityUserPasswo
rdBridgeTest
    [junit] Tests run: 2, Failures: 0, Errors: 2, Time elapsed: 3.626 sec
    [junit] [ERROR] TEST org.apache.geronimo.security.bridge.CallerIdentityUserP
asswordBridgeTest FAILED
    [junit] Running org.apache.geronimo.security.bridge.ConfiguredIdentityUserPa
sswordBridgeTest
    [junit] Tests run: 1, Failures: 0, Errors: 1, Time elapsed: 2.243 sec
    [junit] [ERROR] TEST org.apache.geronimo.security.bridge.ConfiguredIdentityU
serPasswordBridgeTest FAILED
    [junit] Running org.apache.geronimo.security.bridge.MappingUserPasswordBridg
eTest
    [junit] Tests run: 3, Failures: 0, Errors: 3, Time elapsed: 2.413 sec
    [junit] [ERROR] TEST org.apache.geronimo.security.bridge.MappingUserPassword
BridgeTest FAILED
    [junit] Running org.apache.geronimo.security.jaas.ConfigurationEntryTest
    [junit] Tests run: 1, Failures: 0, Errors: 1, Time elapsed: 2.424 sec
    [junit] [ERROR] TEST org.apache.geronimo.security.jaas.ConfigurationEntryTes
t FAILED
    [junit] Running org.apache.geronimo.security.jaas.LoginKerberosNonGeronimoTe
st
    [junit] Tests run: 1, Failures: 0, Errors: 1, Time elapsed: 2.283 sec
    [junit] [ERROR] TEST org.apache.geronimo.security.jaas.LoginKerberosNonGeron
imoTest FAILED
    [junit] Running org.apache.geronimo.security.jaas.LoginKerberosTest
    [junit] Tests run: 1, Failures: 0, Errors: 1, Time elapsed: 2.233 sec
    [junit] [ERROR] TEST org.apache.geronimo.security.jaas.LoginKerberosTest FAI
LED
    [junit] Running org.apache.geronimo.security.jaas.LoginPropertiesFileTest
    [junit] Tests run: 1, Failures: 0, Errors: 1, Time elapsed: 2.423 sec
    [junit] [ERROR] TEST org.apache.geronimo.security.jaas.LoginPropertiesFileTe
st FAILED
    [junit] Running org.apache.geronimo.security.jaas.LoginSQLTest
    [junit] Tests run: 1, Failures: 0, Errors: 1, Time elapsed: 2.284 sec
    [junit] [ERROR] TEST org.apache.geronimo.security.jaas.LoginSQLTest FAILED
    [junit] Running org.apache.geronimo.security.network.protocol.SubjectCarryin
gProtocolTest
    [junit] Tests run: 2, Failures: 0, Errors: 2, Time elapsed: 2.664 sec
    [junit] [ERROR] TEST org.apache.geronimo.security.network.protocol.SubjectCa
rryingProtocolTest FAILED
    [junit] Running org.apache.geronimo.security.remoting.jmx.RemoteLoginTest
    [junit] Tests run: 1, Failures: 0, Errors: 1, Time elapsed: 2.604 sec
    [junit] [ERROR] TEST org.apache.geronimo.security.remoting.jmx.RemoteLoginTe
st FAILED


---------------------------------------------------------------------
JIRA INFORMATION:
This message is automatically generated by JIRA.

If you think it was sent incorrectly contact one of the administrators:
   http://issues.apache.org/jira/secure/Administrators.jspa

If you want more information on JIRA, or have a bug to report see:
   http://www.atlassian.com/software/jira


Mime
View raw message