geronimo-dev mailing list archives

Site index · List index
Message view « Date » · « Thread »
Top « Date » · « Thread »
From David Blevins <david.blev...@visi.com>
Subject Re: [status] build: SUCCESSFUL, test: FAILED | SunOS 5.8, 2004-05-15
Date Sun, 16 May 2004 19:52:30 GMT
Unfortunately, my build script does too good a job cleaning up afterwards.  I'll patch it so
we can all get at the failed builds.


-David

On Sat, May 15, 2004 at 08:38:10PM -0700, David Jencks wrote:
> I've seen this happen occasionally, but rerunning the test it has 
> always passed for me.  I was always busy with other things and never 
> investigated.  Could you send me the test report/stack trace if it is 
> available?
> 
> thanks
> david jencks
> 
> On Saturday, May 15, 2004, at 08:18 PM, David Blevins wrote:
> 
> >On Sat, May 15, 2004 at 09:40:00AM -0000, dblevins@apache.org wrote:
> >>    [junit] [ERROR] TEST 
> >>org.apache.geronimo.connector.work.PooledWorkManagerTest FAILED
> >
> >Interesting.  Any idea why this test failed when there were no code 
> >changes?  Is this a problem withe testing techique or the code?
> >
> >-David
> >

Mime
View raw message