geronimo-dev mailing list archives

Site index · List index
Message view « Date » · « Thread »
Top « Date » · « Thread »
From David Blevins <david.blev...@visi.com>
Subject Re: [status] build: SUCCESSFUL, test: FAILED | SunOS 5.8, 2004-05-15
Date Sun, 16 May 2004 03:18:22 GMT
On Sat, May 15, 2004 at 09:40:00AM -0000, dblevins@apache.org wrote:
>     [junit] [ERROR] TEST org.apache.geronimo.connector.work.PooledWorkManagerTest FAILED

Interesting.  Any idea why this test failed when there were no code changes?  Is this a problem
withe testing techique or the code?

-David

Mime
View raw message