geronimo-dev mailing list archives

Site index · List index
Message view « Date » · « Thread »
Top « Date » · « Thread »
From "Alan D. Cabrera" <...@toolazydogs.com>
Subject RE: Problem with the build!
Date Wed, 18 Feb 2004 13:04:53 GMT
Did you do a "maven clean" before you did a "maven"?  It works for me
and the daily site build.
 
 
Regards,
Alan
 
-----Original Message-----
From: A Carbone [mailto:acarbs@hotmail.com] 
Sent: Wednesday, February 18, 2004 1:15 AM
To: geronimo-dev@incubator.apache.org
Subject: Problem with the build!
 
After getting the build at about 12:30 last night I try to build the
server and it fails in the following section. 
 
My machine details 
Opertating System: Win XP
Java Version: j2sdk1.4.2_02
 
It looks like it could be a check in made late in the evening around
11:30
Failing the remot login test - Alan can you look at if something may
have caused this?
 
Also how can someone get on the CVS mailing list to get notifications
about checkins?
 
If you have more questions that I can answer to help solve the problem
or if you need more info please let me know!
 
~Adam 
 
+----------------------------------------
| Executing (default): Geronimo :: Security
| Memory: 32M/38M
+----------------------------------------
Attempting to download mx4j-SNAPSHOT.jar.
 

default:
java:prepare-filesystem:
 
java:compile:
    [depend] Deleted 0 out of date files in 0 seconds
    [echo] Compiling to C:\geronimo
dev\incubator-geronimo\modules\security/target/classes
 
java:jar-resources:
 
test:prepare-filesystem:
 
test:test-resources:
    [delete] Deleting directory C:\geronimo
dev\incubator-geronimo\modules\security\target\database
    [mkdir] Created dir: C:\geronimo
dev\incubator-geronimo\modules\security\target\database
 
test:compile:
 
test:test:
    [junit] Running
org.apache.geronimo.security.bridge.CallerIdentityUserPasswordBridgeTest
    [junit] Tests run: 2, Failures: 0, Errors: 0, Time elapsed: 2.453
sec
    [junit] Running
org.apache.geronimo.security.bridge.ConfiguredIdentityUserPasswordBridge
Test
    [junit] Tests run: 1, Failures: 0, Errors: 0, Time elapsed: 1.969
sec
    [junit] Running
org.apache.geronimo.security.bridge.MappingUserPasswordBridgeTest
    [junit] Tests run: 3, Failures: 0, Errors: 0, Time elapsed: 2.156
sec
    [junit] Running
org.apache.geronimo.security.EjbModuleConfigurationTest
    [junit] Tests run: 1, Failures: 0, Errors: 0, Time elapsed: 1.859
sec
    [junit] Running
org.apache.geronimo.security.jaas.ConfigurationEntryTest
    [junit] Tests run: 1, Failures: 0, Errors: 0, Time elapsed: 2.016
sec
    [junit] Running
org.apache.geronimo.security.jaas.LoginKerberosNonGeronimoTest
    [junit] Tests run: 1, Failures: 0, Errors: 0, Time elapsed: 1.937
sec
    [junit] Running org.apache.geronimo.security.jaas.LoginKerberosTest
    [junit] Tests run: 1, Failures: 0, Errors: 0, Time elapsed: 1.969
sec
    [junit] Running
org.apache.geronimo.security.jaas.LoginPropertiesFileTest
    [junit] Tests run: 1, Failures: 0, Errors: 0, Time elapsed: 1.984
sec
    [junit] Running org.apache.geronimo.security.jaas.LoginSQLTest
    [junit] Tests run: 1, Failures: 0, Errors: 0, Time elapsed: 5.031
sec
    [junit] Running
org.apache.geronimo.security.remoting.jmx.RemoteLoginTest
    [junit] Tests run: 1, Failures: 0, Errors: 1, Time elapsed: 0.922
sec
    [junit] [ERROR] TEST
org.apache.geronimo.security.remoting.jmx.RemoteLoginTest FAILED
    [junit] Running org.apache.geronimo.security.SecurityServiceTest
    [junit] Tests run: 1, Failures: 0, Errors: 0, Time elapsed: 1.656
sec
    [junit] Running
org.apache.geronimo.security.WebModuleConfigurationTest
    [junit] Tests run: 1, Failures: 0, Errors: 0, Time elapsed: 1.735
sec
 
BUILD FAILED
File...... file:/C:/geronimo dev/incubator-geronimo/
Element... maven:reactor
Line...... 192
Column.... 27
Unable to obtain goal [default] -- file:/C:/Documents and
Settings/ACarbone/.maven/plugins/maven-test-plugin-1.4/:130:54: <fail>
There were test failu
res.
Total time: 1 minutes 12 seconds
Finished at: Wed Feb 18 01:00:24 EST 2004

Mime
View raw message