geronimo-dev mailing list archives

Site index · List index
Message view « Date » · « Thread »
Top « Date » · « Thread »
From Nick Stuart <n...@newtsplace.com>
Subject Re: can't build from cvs
Date Sun, 30 Nov 2003 21:44:26 GMT
Doh...first attempt didnt include the mailing list...lets try this again....


Quoting Nick Stuart <nick@newtsplace.com>:

> I have the same problem, but a little different output:
>
> test:test:
>     [junit] Running org.apache.geronimo.remoting.transport.AsyncTransportTest
>     [junit] Tests run: 2, Failures: 0, Errors: 2, Time elapsed: 8.151 sec
>     [junit] [ERROR] TEST
> org.apache.geronimo.remoting.transport.AsyncTransportTest FAILED
>     [junit] Running org.apache.geronimo.remoting.MarshalingInterceptorsTest
>     [junit] Tests run: 8, Failures: 0, Errors: 0, Time elapsed: 0.269 sec
>     [junit] Running org.apache.geronimo.remoting.RemotingInterceptorsTest
>     [junit] Tests run: 8, Failures: 0, Errors: 8, Time elapsed: 32.246 sec
>     [junit] [ERROR] TEST
> org.apache.geronimo.remoting.RemotingInterceptorsTest
> FAILED
>
> BUILD FAILED
> File...... file:/home/nstuart/java/geronimo/incubator-geronimo/
> Element... maven:reactor
> Line...... 134
> Column.... 27
> Unable to obtain goal [default] --
> file:/home/nstuart/.maven/plugins/maven-test-plugin-1.3/:99:54: <fail> There
> were test failures.
> Total time: 9 minutes 59 seconds
>
> Just checked this out this morning.
>
> -Nick
>
> Quoting Simon Langford <simon.langford@pcmsgroup.com>:
>
> > hi,
> >
> > i checked out from cvs last night, and it doesn't seem to
> > build, anyone know where
> > geronimo-spec-j2ee-management-DEV.jar and
> > geronimo-spec-j2ee-deployment-DEV.jar are?
> >
> > error:
> >
> > +----------------------------------------
> > | Executing (site): Geronimo :: Kernel
> > | Memory: 74M/104M
> > +----------------------------------------
> > Attempting to download commons-collections-SNAPSHOT.jar.
> > Attempting to download
> > geronimo-spec-j2ee-management-DEV.jar.
> > WARNING: Failed to download
> > geronimo-spec-j2ee-management-DEV.jar.
> > Attempting to download
> > geronimo-spec-j2ee-deployment-DEV.jar.
> > WARNING: Failed to download
> > geronimo-spec-j2ee-deployment-DEV.jar.
> > Attempting to download mx4j-SNAPSHOT.jar.
> >
> > BUILD FAILED
> > File...... file:/C:/incubator-geronimo/
> > Element... maven:reactor
> > Line...... 134
> > Column.... 27
> > The build cannot continue because of the following
> > unsatisfied dependencies:
> >
> > geronimo-spec-j2ee-management-DEV.jar (no download url
> > specified)
> > geronimo-spec-j2ee-deployment-DEV.jar (no download url
> > specified)
> >
> > Total time: 1 minutes 7 seconds
> > Finished at: Sun Nov 30 11:45:17 CET 2003
> >
> > thanks
> >
> > simon
> > The information contained in this e-mail is intended only for the person or
> > entity to which it is addressed and may contain confidential and/or
> > privileged material.  If You are not the intended recipient of this e-mail,
> > the use of this information or any disclosure, copying or distribution is
> > Prohibited and may be unlawful.  If you received this in error, please
> > contact the sender and delete the material from any computer.  The views
> > expressed in this e-mail may not necessarily be the views of The PCMS Group
> > plc and should not be taken as authority to carry out any instruction
> > contained.
> >
>
>
> ----------------------------------------------------------------
> This message was sent using IMP, the Internet Messaging Program.
>

----------------------------------------------------------------
This message was sent using IMP, the Internet Messaging Program.

Mime
View raw message