geronimo-dev mailing list archives

Site index · List index
Message view « Date » · « Thread »
Top « Date » · « Thread »
Subject [jira] Updated: (GERONIMO-85) [ERROR] TEST o.a.g.remoting.transport.AsyncTransportTest FAILED
Date Tue, 07 Oct 2003 14:52:30 GMT
The following issue has been updated:

    Updater: Jacek Laskowski (
       Date: Tue, 7 Oct 2003 9:51 AM
Changing the priority. I still can't build Geronimo on HP-UX (which means it's actually a
blocker), but I'll be contacting people in charge of HP JDK to see how it may be fixed in
the upcoming version (which means it's not a problem with Geronimo, but other pieces the software
is to be running upon).
             priority changed from Critical
For a full history of the issue, see:

View the issue:

Here is an overview of the issue:
        Key: GERONIMO-85
    Summary: [ERROR] TEST o.a.g.remoting.transport.AsyncTransportTest FAILED
       Type: Bug

     Status: Unassigned
   Priority: Minor

 Time Spent: Unknown
  Remaining: Unknown

    Project: Apache Geronimo

   Reporter: Jacek Laskowski

    Created: Tue, 16 Sep 2003 6:23 AM
    Updated: Tue, 7 Oct 2003 9:51 AM
Environment: HP-UX xxx B.11.00 A 9000/802 + HP JDK
CYGWIN_NT-5.0 xxx 1.5.4(0.94/3/2) 2003-09-12 23:08 i686 unknown unknown Cygwin + Sun JDK 1.4.2_01

The test - o.a.g.remoting.transport.AsyncTransportTest - fails on Cygwin with the following
error message:

    [junit] [ERROR] TEST org.apache.geronimo.remoting.RemotingInterceptorsTest FAILED
    [junit] Running org.apache.geronimo.remoting.transport.AsyncTransportTest
    [junit] Tests run: 2, Failures: 0, Errors: 2, Time elapsed: 146,641 sec
    [junit] [ERROR] TEST org.apache.geronimo.remoting.transport.AsyncTransportTest FAILED
    [junit] Running org.apache.geronimo.rmi.RMIClassLoaderSpiImplTest
    [junit] Tests run: 2, Failures: 0, Errors: 0, Time elapsed: 0,881 sec
    [junit] Running org.apache.geronimo.xml.deployment.AppClientLoaderTest
    [junit] Tests run: 1, Failures: 0, Errors: 0, Time elapsed: 5,217 sec
    [junit] Running org.apache.geronimo.xml.deployment.EntityResolverTest
    [junit] Tests run: 1, Failures: 0, Errors: 0, Time elapsed: 0,902 sec
    [junit] Running org.apache.geronimo.xml.deployment.GeronimoAppClientLoaderTest
    [junit] Tests run: 1, Failures: 0, Errors: 0, Time elapsed: 4,817 sec

However, on HP-UX it hangs on AsyncTransportTest.

The priority of the bug is Critical as because of this I'm not able to build Geronimo neither
on Cygwin (Win2k) nor HP-UX :-(


This message is automatically generated by JIRA.

If you think it was sent incorrectly contact one of the administrators:

If you want more information on JIRA, or have a bug to report see:

View raw message