geronimo-dev mailing list archives

Site index · List index
Message view « Date » · « Thread »
Top « Date » · « Thread »
From Jacek Laskowski <jacek_laskow...@hp.com>
Subject Re: org.apache.geronimo.common.task.URLMonitorTaskTest FAILED
Date Fri, 12 Sep 2003 13:20:54 GMT
Jason Dillon wrote:
> What os r u running?

Cygwin 1.5.3 with Win2k underneath.

.....
     [junit] [ERROR] TEST 
org.apache.geronimo.common.task.URLMonitorTaskTest FAILED
     [junit] Running org.apache.geronimo.common.ThrowableHandlerTest
     [junit] Tests run: 1, Failures: 0, Errors: 0, Time elapsed: 0,141 sec

BUILD FAILED
File...... file:/c:/_Jacek/projects/_CVS_/geronimo/
Element... maven:reactor
Line...... 134
Column.... 27
Unable to obtain goal [default] -- file:/C:/Documents and 
Settings/jl540585/.maven/plugins/maven-test-plugin-1.3/:99:54: <fail> 
There were test failures.
Total time: 1 minutes 56 seconds


/cygdrive/c/_Jacek/projects/_CVS_/geronimo
 > java -version
java version "1.4.1_03"
Java(TM) 2 Runtime Environment, Standard Edition (build 1.4.1_03-b02)
Java HotSpot(TM) Client VM (build 1.4.1_03-b02, mixed mode)

/cygdrive/c/_Jacek/projects/_CVS_/geronimo
 > uname -a
CYGWIN_NT-5.0 warn3236 1.5.3(0.90/3/2) 2003-09-01 13:15 i686 unknown 
unknown Cygwin

On HP-UX 11.0 maven hangs while running 
org.apache.geronimo.remoting.transport.AsyncTransportTest

     [junit] Tests run: 8, Failures: 0, Errors: 0, Time elapsed: 11,046 sec
     [junit] Running org.apache.geronimo.naming.java.ContextBuilderTest
     [junit] Tests run: 1, Failures: 0, Errors: 0, Time elapsed: 6,169 sec
     [junit] Running 
org.apache.geronimo.remoting.transport.AsyncTransportTest

and doing kill -QUIT <junittestrunner_processId> reveals what's in the 
attachement.

Also do we accept the following message:

     [javac] Compiling 30 source files to 
/disk/home/jacekl/cvs/incubator-geronimo/modules/core/target/test-classes
Note: 
/disk/home/jacekl/cvs/incubator-geronimo/modules/core/src/test/org/apache/geronimo/test/protocol/mockproto/Handler.java

uses or overrides a deprecated API.
Note: Recompile with -deprecation for details.

I suppose the class uses some old and deprecated method, which should be 
avoided as we just begun the project, shouldn't it?

I'm going to get rid of the failures by removing appropriate test 
classes. Once I handle building Geronimo, I'd approach to fix them if 
noone objects.

> 
> --jason

-Jacek

Mime
View raw message