geronimo-dev mailing list archives

Site index · List index
Message view « Date » · « Thread »
Top « Date » · « Thread »
From founder_chen <founder_c...@yahoo.com.cn>
Subject Re: [Build ] Errors ans Warns
Date Tue, 16 Sep 2003 11:43:50 GMT
Hi, 
  I just checked the clear project out from cvs and
rebuildt it 2 hours ago, but ERROR was still there:
    [junit] Tests run: 1, Failures: 0, Errors: 1, Time
elapsed: 0.24 sec
    [junit] [ERROR] TEST
javax.mail.internet.MailDateFormatTest FAILED

  Well, in my maven log, there are some other problem:
(My Runtime: winxp en SP1, jdk1.4.2)

Note:
F:\devtool\eclipse3.0\workspace\incubator-geronimo\specs\ejb\src\java\javax\ejb\EJBContext.java
uses or overrides a deprecated API.
Note: Recompile with -deprecation for details.
Note: Some input files use or override a deprecated
API.
Note: Recompile with -deprecation for details.
Note: Some input files use or override a deprecated
API.
Note: Recompile with -deprecation for details.
Note:
F:\devtool\eclipse3.0\workspace\incubator-geronimo\modules\core\src\test\org\apache\geronimo\test\protocol\mockproto\Handler.java
uses or overrides a deprecated API.
Note: Recompile with -deprecation for details.
Note:
F:\devtool\eclipse3.0\workspace\incubator-geronimo\specs\activation\src\java\javax\activation\ActivationDataFlavor.java
uses or overrides a deprecated API.
Note: Recompile with -deprecation for details.
BUILD FAILED
File......
file:/F:/devtool/eclipse3.0/workspace/incubator-geronimo/
Element... maven:reactor
Line...... 134
Column.... 27
Unable to obtain goal [default] -- file:/C:/Documents
and
Settings/admin/.maven/plugins/maven-test-plugin-1.3/:99:54:
<fail> There were test failures.

Sincerely
founder_chen

-----Original Email-----
Sender: Prabhakar Chaganti
[mailto:prabhakar@chaganti.net] 
Time: 2003年9月16日 12:05
Recipient: geronimo-dev@incubator.apache.org
Subject: Re: [Build ] Errors ans Warns

Delete your app directory and checkout a clean cvs
source and rebuild.

-prabhakar

>     Sorry, I have copy the incorrect log info, here
is
> the ERROR info:
> 
>    [junit] Tests run: 1, Failures: 0, Errors: 1,
Time
> elapsed: 0.19 sec
>     [junit] [ERROR] TEST
> javax.mail.internet.MailDateFormatTest FAILED


_________________________________________________________
Do You Yahoo!? 
启用电邮帐号,领会雅虎通[身临其境聊电影]的动感魅力,还有网络摄像头+雅虎通收音机等你来拿
http://cn.rd.yahoo.com/mail_cn/tag/?http://cn.messenger.yahoo.com

Mime
View raw message