geronimo-dev mailing list archives

Site index · List index
Message view « Date » · « Thread »
Top « Date » · « Thread »
From "Emerson Cargnin" <echoflor...@bol.com.br>
Subject Re: error at building
Date Fri, 05 Sep 2003 06:03:38 GMT
Sorry, the email just slip from my keyboard :)

    [junit] Running javax.mail.URLNameTest
    [junit] Tests run: 7, Failures: 0, Errors: 0, Time elapsed: 1,86 sec

BUILD FAILED
File...... file:/C:/eclipse/workspace/incubator-geronimo/
Element... maven:reactor
Line...... 134
Column.... 13
Unable to obtain goal [default] -- file:/C:/Documents and Settings/Administrador
/.maven/plugins/maven-test-plugin-1.3/:99:54: <fail> There were test failures.
Total time: 3 minutes 10 seconds
  ----- Original Message ----- 
  From: Emerson Cargnin 
  To: geronimo-dev@incubator.apache.org 
  Sent: Friday, September 05, 2003 3:02 AM
  Subject: error at building 


  I tried rebuild, clean+build clean+maven(alone) and aways got the following error :

Mime
View raw message