geode-issues mailing list archives

Site index · List index
Message view « Date » · « Thread »
Top « Date » · « Thread »
From "Mark Hanson (Jira)" <j...@apache.org>
Subject [jira] [Resolved] (GEODE-7065) CI Failure in ShowDeadlockOverHttpDUnitTest
Date Fri, 08 Nov 2019 18:29:00 GMT

     [ https://issues.apache.org/jira/browse/GEODE-7065?page=com.atlassian.jira.plugin.system.issuetabpanels:all-tabpanel
]

Mark Hanson resolved GEODE-7065.
--------------------------------
    Resolution: Duplicate

> CI Failure in ShowDeadlockOverHttpDUnitTest
> -------------------------------------------
>
>                 Key: GEODE-7065
>                 URL: https://issues.apache.org/jira/browse/GEODE-7065
>             Project: Geode
>          Issue Type: Test
>          Components: gfsh
>            Reporter: Owen Nichols
>            Assignee: Mark Hanson
>            Priority: Major
>
> {noformat}
> org.apache.geode.management.internal.cli.commands.ShowDeadlockOverHttpDUnitTest >
testDistributedDeadlockWithFunction FAILED
>     org.apache.geode.test.dunit.RMIException: While invoking org.apache.geode.management.internal.cli.commands.ShowDeadlockDistributedTestBase$$Lambda$64/2112888748.run
in VM 1 running on Host 41a1a4d5dcf9 with 4 VMs
>         Caused by:
>         org.awaitility.core.ConditionTimeoutException: Condition with org.apache.geode.management.internal.cli.commands.ShowDeadlockDistributedTestBase
was not fulfilled within 300 seconds.
> org.apache.geode.management.internal.cli.commands.ShowDeadlockOverHttpDUnitTest >
testNoDeadlock FAILED
>     org.apache.geode.test.dunit.RMIException: While invoking org.apache.geode.management.internal.cli.commands.ShowDeadlockDistributedTestBase$$Lambda$64/2112888748.run
in VM 1 running on Host 41a1a4d5dcf9 with 4 VMs
>         Caused by:
>         org.awaitility.core.ConditionTimeoutException: Condition with org.apache.geode.management.internal.cli.commands.ShowDeadlockDistributedTestBase
was not fulfilled within 300 seconds.
> 136 tests completed, 2 failed
> {noformat}
> seeĀ [https://concourse.apachegeode-ci.info/teams/main/pipelines/apache-develop-main/jobs/DistributedTestOpenJDK8/builds/974]
> {noformat}
> =-=-=-=-=-=-=-=-=-=-=-=-=-=-=  Test Results URI =-=-=-=-=-=-=-=-=-=-=-=-=-=-=-=-=
> http://files.apachegeode-ci.info/builds/apache-develop-main/1.11.0-SNAPSHOT.0018/test-results/distributedTest/1565293755/
> =-=-=-=-=-=-=-=-=-=-=-=-=-=-=-=-=-=-=-=-=-=-=-=-=-=-=-=-=-=-=-=-=-=-=-=-=-=-=-=-=
> Test report artifacts from this job are available at:
> http://files.apachegeode-ci.info/builds/apache-develop-main/1.11.0-SNAPSHOT.0018/test-artifacts/1565293755/distributedtestfiles-OpenJDK8-1.11.0-SNAPSHOT.0018.tgz
> {noformat}



--
This message was sent by Atlassian Jira
(v8.3.4#803005)

Mime
View raw message