geode-issues mailing list archives

Site index · List index
Message view « Date » · « Thread »
Top « Date » · « Thread »
From "Mark Hanson (Jira)" <j...@apache.org>
Subject [jira] [Created] (GEODE-7258) RollingUpgradeQueryReturnsCorrectResultsAfterClientAndServersAreRolledOverAllBucketsCreated > test[from_v1.10.0, with reindex=true] FAILED
Date Tue, 01 Oct 2019 00:06:00 GMT
Mark Hanson created GEODE-7258:
----------------------------------

             Summary: RollingUpgradeQueryReturnsCorrectResultsAfterClientAndServersAreRolledOverAllBucketsCreated
> test[from_v1.10.0, with reindex=true] FAILED
                 Key: GEODE-7258
                 URL: https://issues.apache.org/jira/browse/GEODE-7258
             Project: Geode
          Issue Type: Bug
          Components: tests
            Reporter: Mark Hanson


RollingUpgradeQueryReturnsCorrectResultsAfterClientAndServersAreRolledOverAllBucketsCreated
> test[from_v1.10.0, with reindex=true] FAILED

This test is failing repeatedly. The logs do not to my eyes indicate what is the source of
the problem.

[https://concourse.apachegeode-ci.info/teams/main/pipelines/apache-develop-main/jobs/UpgradeTestOpenJDK11/builds/1112]

[https://concourse.apachegeode-ci.info/teams/main/pipelines/apache-develop-main/jobs/UpgradeTestOpenJDK11/builds/1113]

 

=-=-=-=-=-=-=-=-=-=-=-=-=-=-= Test Results URI =-=-=-=-=-=-=-=-=-=-=-=-=-=-=-=-=
http://files.apachegeode-ci.info/builds/apache-develop-main/1.11.0-SNAPSHOT.0169/test-results/upgradeTest/1569861659/
=-=-=-=-=-=-=-=-=-=-=-=-=-=-=-=-=-=-=-=-=-=-=-=-=-=-=-=-=-=-=-=-=-=-=-=-=-=-=-=-=

Test report artifacts from this job are available at:

http://files.apachegeode-ci.info/builds/apache-develop-main/1.11.0-SNAPSHOT.0169/test-artifacts/1569861659/upgradetestfiles-OpenJDK11-1.11.0-SNAPSHOT.0169.tgz

 


=-=-=-=-=-=-=-=-=-=-=-=-=-=-= Test Results URI =-=-=-=-=-=-=-=-=-=-=-=-=-=-=-=-=
http://files.apachegeode-ci.info/builds/apache-develop-main/1.11.0-SNAPSHOT.0170/test-results/upgradeTest/1569863814/
=-=-=-=-=-=-=-=-=-=-=-=-=-=-=-=-=-=-=-=-=-=-=-=-=-=-=-=-=-=-=-=-=-=-=-=-=-=-=-=-=

Test report artifacts from this job are available at:

http://files.apachegeode-ci.info/builds/apache-develop-main/1.11.0-SNAPSHOT.0170/test-artifacts/1569863814/upgradetestfiles-OpenJDK11-1.11.0-SNAPSHOT.0170.tgz

 
{noformat}
Task :geode-lucene:upgradeTest
org.apache.geode.cache.lucene.RollingUpgradeQueryReturnsCorrectResultsAfterClientAndServersAreRolledOverAllBucketsCreated
> test[from_v1.10.0, with reindex=true] FAILED
 org.apache.geode.test.dunit.RMIException: While invoking org.apache.geode.cache.lucene.RollingUpgradeQueryReturnsCorrectResultsAfterClientAndServersAreRolledOverAllBucketsCreated$$Lambda$172/0x00000008407b2440.run
in VM 3 running on Host 38006782570a with 4 VMs with version 1.10.0
 at org.apache.geode.test.dunit.VM.executeMethodOnObject(VM.java:579)
 at org.apache.geode.test.dunit.VM.invoke(VM.java:406)
 at org.apache.geode.cache.lucene.RollingUpgradeQueryReturnsCorrectResultsAfterClientAndServersAreRolledOverAllBucketsCreated.test(RollingUpgradeQueryReturnsCorrectResultsAfterClientAndServersAreRolledOverAllBucketsCreated.java:111)
Caused by:
 java.lang.reflect.InvocationTargetException
 at jdk.internal.reflect.NativeMethodAccessorImpl.invoke0(Native Method)
 at jdk.internal.reflect.NativeMethodAccessorImpl.invoke(NativeMethodAccessorImpl.java:62)
 at jdk.internal.reflect.DelegatingMethodAccessorImpl.invoke(DelegatingMethodAccessorImpl.java:43)
 at java.lang.reflect.Method.invoke(Method.java:566)
 at org.apache.geode.cache.lucene.LuceneSearchWithRollingUpgradeDUnit.verifyLuceneQueryResults(LuceneSearchWithRollingUpgradeDUnit.java:381)
 at org.apache.geode.cache.lucene.RollingUpgradeQueryReturnsCorrectResultsAfterClientAndServersAreRolledOverAllBucketsCreated.lambda$test$c93719d5$2(RollingUpgradeQueryReturnsCorrectResultsAfterClientAndServersAreRolledOverAllBucketsCreated.java:111)
Caused by:
 org.apache.geode.cache.execute.FunctionException: org.apache.geode.cache.client.ServerConnectivityException:
Could not create a new connection to server 38006782570a:24478
 at org.apache.geode.internal.cache.execute.ServerRegionFunctionExecutor.executeOnServer(ServerRegionFunctionExecutor.java:209)
 at org.apache.geode.internal.cache.execute.ServerRegionFunctionExecutor.executeFunction(ServerRegionFunctionExecutor.java:152)
 at org.apache.geode.internal.cache.execute.ServerRegionFunctionExecutor.execute(ServerRegionFunctionExecutor.java:379)
 at org.apache.geode.cache.lucene.internal.LuceneServiceImpl.waitUntilFlushed(LuceneServiceImpl.java:658)
 ... 6 more
Caused by:
 org.apache.geode.cache.client.ServerConnectivityException: Could not create a new connection
to server 38006782570a:24478
108 tests completed, 1 failed
> Task :geode-lucene:upgradeTest FAILED {noformat}
 



--
This message was sent by Atlassian Jira
(v8.3.4#803005)

Mime
View raw message