geode-issues mailing list archives

Site index · List index
Message view « Date » · « Thread »
Top « Date » · « Thread »
From "Dan Smith (JIRA)" <j...@apache.org>
Subject [jira] [Commented] (GEODE-5470) SUPERFLAKY: DlockAndTxlockRegressionTest > testDLockProtectsAgainstTransactionConflict FAILED
Date Wed, 01 Aug 2018 22:55:00 GMT

    [ https://issues.apache.org/jira/browse/GEODE-5470?page=com.atlassian.jira.plugin.system.issuetabpanels:comment-tabpanel&focusedCommentId=16566121#comment-16566121
] 

Dan Smith commented on GEODE-5470:
----------------------------------

This test is also failing with the below failure:

{noformat}
org.awaitility.core.ConditionTimeoutException: Condition with alias 'check for new transactions'
didn't complete within 30 seconds because condition with lambda expression in org.apache.geode.distributed.internal.DlockAndTxlockRegressionTest
was not fulfilled.
	at org.awaitility.core.ConditionAwaiter.await(ConditionAwaiter.java:104)
	at org.awaitility.core.CallableCondition.await(CallableCondition.java:79)
	at org.awaitility.core.CallableCondition.await(CallableCondition.java:27)
	at org.awaitility.core.ConditionFactory.until(ConditionFactory.java:809)
	at org.awaitility.core.ConditionFactory.until(ConditionFactory.java:785)
	at org.apache.geode.distributed.internal.DlockAndTxlockRegressionTest.testDLockProtectsAgainstTransactionConflict(DlockAndTxlockRegressionTest.java:133)
{noformat}

> SUPERFLAKY: DlockAndTxlockRegressionTest > testDLockProtectsAgainstTransactionConflict
FAILED
> ---------------------------------------------------------------------------------------------
>
>                 Key: GEODE-5470
>                 URL: https://issues.apache.org/jira/browse/GEODE-5470
>             Project: Geode
>          Issue Type: Bug
>            Reporter: Jinmei Liao
>            Assignee: Dan Smith
>            Priority: Major
>              Labels: swat
>
> https://concourse.apachegeode-ci.info/teams/main/pipelines/develop/jobs/DistributedTest/builds/139
>  
> org.apache.geode.distributed.internal.DlockAndTxlockRegressionTest > testDLockProtectsAgainstTransactionConflict
FAILED
>  [ |https://concourse.apachegeode-ci.info/teams/main/pipelines/develop/jobs/DistributedTest/builds/139#L5b4cf155:255]
>  java.lang.RuntimeException: test failed
>  [ |https://concourse.apachegeode-ci.info/teams/main/pipelines/develop/jobs/DistributedTest/builds/139#L5b4cf155:256]
>  at org.apache.geode.distributed.internal.DlockAndTxlockRegressionTest.testDLockProtectsAgainstTransactionConflict(DlockAndTxlockRegressionTest.java:161)
>  [ |https://concourse.apachegeode-ci.info/teams/main/pipelines/develop/jobs/DistributedTest/builds/139#L5b4cf155:257]
>   
>  [ |https://concourse.apachegeode-ci.info/teams/main/pipelines/develop/jobs/DistributedTest/builds/139#L5b4cf155:258]
>  Caused by:
>  [ |https://concourse.apachegeode-ci.info/teams/main/pipelines/develop/jobs/DistributedTest/builds/139#L5b4cf155:259]
>  java.lang.RuntimeException: dlock failed to prevent a transaction conflict
>  [ |https://concourse.apachegeode-ci.info/teams/main/pipelines/develop/jobs/DistributedTest/builds/139#L5b4cf155:260]
>  at org.apache.geode.distributed.internal.DlockAndTxlockRegressionTest.performOps(DlockAndTxlockRegressionTest.java:234)
>  [ |https://concourse.apachegeode-ci.info/teams/main/pipelines/develop/jobs/DistributedTest/builds/139#L5b4cf155:261]
>  at org.apache.geode.distributed.internal.DlockAndTxlockRegressionTest.lambda$testDLockProtectsAgainstTransactionConflict$bb17a952$5(DlockAndTxlockRegressionTest.java:123)
>  [ |https://concourse.apachegeode-ci.info/teams/main/pipelines/develop/jobs/DistributedTest/builds/139#L5b4cf155:262]
>   
>  [ |https://concourse.apachegeode-ci.info/teams/main/pipelines/develop/jobs/DistributedTest/builds/139#L5b4cf155:263]
>  Caused by:
>  [ |https://concourse.apachegeode-ci.info/teams/main/pipelines/develop/jobs/DistributedTest/builds/139#L5b4cf155:264]
>  org.apache.geode.cache.CommitConflictException: Concurrent transaction commit detected
The key TestKey in region /TestRegion was being modified by another transaction locally.
>  [ |https://concourse.apachegeode-ci.info/teams/main/pipelines/develop/jobs/DistributedTest/builds/139#L5b4cf155:265]
>  at org.apache.geode.internal.cache.locks.TXLockServiceImpl.txLock(TXLockServiceImpl.java:137)
>  [ |https://concourse.apachegeode-ci.info/teams/main/pipelines/develop/jobs/DistributedTest/builds/139#L5b4cf155:266]
>  at org.apache.geode.internal.cache.TXLockRequest.obtain(TXLockRequest.java:88)
>  [ |https://concourse.apachegeode-ci.info/teams/main/pipelines/develop/jobs/DistributedTest/builds/139#L5b4cf155:267]
>  at org.apache.geode.internal.cache.TXState.reserveAndCheck(TXState.java:340)
>  [ |https://concourse.apachegeode-ci.info/teams/main/pipelines/develop/jobs/DistributedTest/builds/139#L5b4cf155:268]
>  at org.apache.geode.internal.cache.TXState.commit(TXState.java:411)
>  [ |https://concourse.apachegeode-ci.info/teams/main/pipelines/develop/jobs/DistributedTest/builds/139#L5b4cf155:269]
>  at org.apache.geode.internal.cache.TXStateProxyImpl.commit(TXStateProxyImpl.java:210)
>  [ |https://concourse.apachegeode-ci.info/teams/main/pipelines/develop/jobs/DistributedTest/builds/139#L5b4cf155:270]
>  at org.apache.geode.internal.cache.TXManagerImpl.commit(TXManagerImpl.java:413)
>  [ |https://concourse.apachegeode-ci.info/teams/main/pipelines/develop/jobs/DistributedTest/builds/139#L5b4cf155:271]
>  at org.apache.geode.distributed.internal.DlockAndTxlockRegressionTest.performOps(DlockAndTxlockRegressionTest.java:232)
>  [ |https://concourse.apachegeode-ci.info/teams/main/pipelines/develop/jobs/DistributedTest/builds/139#L5b4cf155:272]
>  ... 1 more
>   



--
This message was sent by Atlassian JIRA
(v7.6.3#76005)

Mime
View raw message