geode-issues mailing list archives

Site index · List index
Message view « Date » · « Thread »
Top « Date » · « Thread »
From "Kenneth Howe (JIRA)" <j...@apache.org>
Subject [jira] [Reopened] (GEODE-3720) CI Failure: ConnectCommandWithSSLTest failed
Date Wed, 11 Oct 2017 20:15:00 GMT

     [ https://issues.apache.org/jira/browse/GEODE-3720?page=com.atlassian.jira.plugin.system.issuetabpanels:all-tabpanel
]

Kenneth Howe reopened GEODE-3720:
---------------------------------

Some tests in this class continue to fail intermittently on precheckin and nightly build runs.
Latest case was on https://builds.apache.org/view/All/job/Geode-nightly/980/ . As far as I
can determine, the tests have not been seen to fail when class is run be itself.

{code}
java.lang.AssertionError: 
Expecting:
 <"?[34m    _________________________     __
   / _____/ ______/ ______/ /____/ /
  / /  __/ /___  /_____  / _____  / 
 / /__/ / ____/  _____/ / /    / /  
/______/_/      /______/_/    /_/    1.3.0-SNAPSHOT
?[0m
?[36mMonitor and Manage Apache Geode?[0m
Connecting to Locator at [host=localhost, port=36478] ..
Connection reset

">
to contain:
 <"trying to connect a non-SSL-enabled client to an SSL-enabled locator"> 
	at org.apache.geode.management.internal.cli.commands.ConnectCommandWithSSLTest.connectWithNoSSL(ConnectCommandWithSSLTest.java:181)
	at sun.reflect.NativeMethodAccessorImpl.invoke0(Native Method)
	at sun.reflect.NativeMethodAccessorImpl.invoke(NativeMethodAccessorImpl.java:62)
{code}

> CI Failure: ConnectCommandWithSSLTest failed
> --------------------------------------------
>
>                 Key: GEODE-3720
>                 URL: https://issues.apache.org/jira/browse/GEODE-3720
>             Project: Geode
>          Issue Type: Bug
>    Affects Versions: 1.2.1
>            Reporter: Jinmei Liao
>            Assignee: Jinmei Liao
>
> org.apache.geode.management.internal.cli.commands.ConnectCommandWithSSLTest > connectWithSSL
FAILED
>     org.junit.ComparisonFailure: expected:<[tru]e> but was:<[fals]e>
>         at sun.reflect.NativeConstructorAccessorImpl.newInstance0(Native Method)
>         at sun.reflect.NativeConstructorAccessorImpl.newInstance(NativeConstructorAccessorImpl.java:62)
>         at sun.reflect.DelegatingConstructorAccessorImpl.newInstance(DelegatingConstructorAccessorImpl.java:45)
>         at org.apache.geode.management.internal.cli.commands.ConnectCommandWithSSLTest.connectWithSSL(ConnectCommandWithSSLTest.java:198)
> org.apache.geode.management.internal.cli.commands.ConnectCommandWithSSLTest > connectWithNoSSL
FAILED
>     org.junit.ComparisonFailure: expected:<[fals]e> but was:<[tru]e>
>         at sun.reflect.NativeConstructorAccessorImpl.newInstance0(Native Method)
>         at sun.reflect.NativeConstructorAccessorImpl.newInstance(NativeConstructorAccessorImpl.java:62)
>         at sun.reflect.DelegatingConstructorAccessorImpl.newInstance(DelegatingConstructorAccessorImpl.java:45)
>         at org.apache.geode.management.internal.cli.commands.ConnectCommandWithSSLTest.connectWithNoSSL(ConnectCommandWithSSLTest.java:177)
> org.apache.geode.management.internal.cli.commands.ConnectCommandWithSSLTest > connectWithClusterAndJmxSSL
FAILED
>     org.junit.ComparisonFailure: expected:<[tru]e> but was:<[fals]e>
>         at sun.reflect.NativeConstructorAccessorImpl.newInstance0(Native Method)
>         at sun.reflect.NativeConstructorAccessorImpl.newInstance(NativeConstructorAccessorImpl.java:62)
>         at sun.reflect.DelegatingConstructorAccessorImpl.newInstance(DelegatingConstructorAccessorImpl.java:45)
>         at org.apache.geode.management.internal.cli.commands.ConnectCommandWithSSLTest.connectWithClusterAndJmxSSL(ConnectCommandWithSSLTest.java:309)
> org.apache.geode.management.internal.cli.commands.ConnectCommandWithSSLTest > connectWithSSLAndThenWithNoSSL
FAILED
>     org.junit.ComparisonFailure: expected:<[tru]e> but was:<[fals]e>
>         at sun.reflect.NativeConstructorAccessorImpl.newInstance0(Native Method)
>         at sun.reflect.NativeConstructorAccessorImpl.newInstance(NativeConstructorAccessorImpl.java:62)
>         at sun.reflect.DelegatingConstructorAccessorImpl.newInstance(DelegatingConstructorAccessorImpl.java:45)
>         at org.apache.geode.management.internal.cli.commands.ConnectCommandWithSSLTest.connectWithSSLAndThenWithNoSSL(ConnectCommandWithSSLTest.java:320)
> org.apache.geode.management.internal.cli.commands.ConnectCommandWithSSLTest > connectWithHttpSSLAndSkipSSLValidation
FAILED
>     org.junit.ComparisonFailure: expected:<[fals]e> but was:<[tru]e>
>         at sun.reflect.NativeConstructorAccessorImpl.newInstance0(Native Method)
>         at sun.reflect.NativeConstructorAccessorImpl.newInstance(NativeConstructorAccessorImpl.java:62)
>         at sun.reflect.DelegatingConstructorAccessorImpl.newInstance(DelegatingConstructorAccessorImpl.java:45)
>         at org.apache.geode.management.internal.cli.commands.ConnectCommandWithSSLTest.connectWithHttpSSLAndSkipSSLValidation(ConnectCommandWithSSLTest.java:286)
> org.apache.geode.management.internal.cli.commands.ConnectCommandWithSSLTest > connectWithClusterSSL
FAILED
>     org.junit.ComparisonFailure: expected:<[tru]e> but was:<[fals]e>
>         at sun.reflect.NativeConstructorAccessorImpl.newInstance0(Native Method)
>         at sun.reflect.NativeConstructorAccessorImpl.newInstance(NativeConstructorAccessorImpl.java:62)
>         at sun.reflect.DelegatingConstructorAccessorImpl.newInstance(DelegatingConstructorAccessorImpl.java:45)
>         at org.apache.geode.management.internal.cli.commands.ConnectCommandWithSSLTest.connectWithClusterSSL(ConnectCommandWithSSLTest.java:246)
> org.apache.geode.management.internal.cli.commands.ConnectCommandWithSSLTest > connectWithJmxSSL
FAILED
>     java.lang.AssertionError: 
>     Expecting:
>      <"    _________________________     __
>        / _____/ ______/ ______/ /____/ /
>       / /  __/ /___  /_____  / _____  / 
>      / /__/ / ____/  _____/ / /    / /  
>     /______/_/      /______/_/    /_/    0.0.0
>     
>     Monitor and Manage Pivotal GemFire
>     Connecting to Locator at [host=localhost, port=34968] ..
>     Connecting to Manager at [host=eea6f0b8db23, port=28757] ..
>     Could not connect to : [host=eea6f0b8db23, port=28757]. Failed to retrieve RMIServer
stub: javax.naming.CommunicationException [Root exception is java.rmi.ConnectIOException:
error during JRMP connection establishment; nested exception is: 
>     	javax.net.ssl.SSLHandshakeException: Remote host closed connection during handshake]
>     ">
>     not to contain:
>      <"Connecting to Manager at"> 
>         at org.apache.geode.management.internal.cli.commands.ConnectCommandWithSSLTest.connectWithJmxSSL(ConnectCommandWithSSLTest.java:218)
> org.apache.geode.management.internal.cli.commands.ConnectCommandWithSSLTest > connectWithHttpSSL
FAILED
>     org.junit.ComparisonFailure: expected:<[fals]e> but was:<[tru]e>
>         at sun.reflect.NativeConstructorAccessorImpl.newInstance0(Native Method)
>         at sun.reflect.NativeConstructorAccessorImpl.newInstance(NativeConstructorAccessorImpl.java:62)
>         at sun.reflect.DelegatingConstructorAccessorImpl.newInstance(DelegatingConstructorAccessorImpl.java:45)
>         at org.apache.geode.management.internal.cli.commands.ConnectCommandWithSSLTest.connectWithHttpSSL(ConnectCommandWithSSLTest.java:267)
> 68 tests completed, 8 failed



--
This message was sent by Atlassian JIRA
(v6.4.14#64029)

Mime
View raw message