geode-issues mailing list archives

Site index · List index
Message view « Date » · « Thread »
Top « Date » · « Thread »
From "Anthony Baker (JIRA)" <j...@apache.org>
Subject [jira] [Closed] (GEODE-2649) ExportLogsDUnitTest.testExportWithStartAndEndDateTimeFiltering fails with AssertionError
Date Sat, 17 Jun 2017 18:04:33 GMT

     [ https://issues.apache.org/jira/browse/GEODE-2649?page=com.atlassian.jira.plugin.system.issuetabpanels:all-tabpanel
]

Anthony Baker closed GEODE-2649.
--------------------------------

> ExportLogsDUnitTest.testExportWithStartAndEndDateTimeFiltering fails with AssertionError
> ----------------------------------------------------------------------------------------
>
>                 Key: GEODE-2649
>                 URL: https://issues.apache.org/jira/browse/GEODE-2649
>             Project: Geode
>          Issue Type: Bug
>          Components: gfsh, tests
>            Reporter: Kirk Lund
>            Assignee: Jared Stewart
>              Labels: CI
>             Fix For: 1.2.0
>
>
> {noformat}
> org.apache.geode.management.internal.cli.commands.ExportLogsDUnitTest > testExportWithStartAndEndDateTimeFiltering
FAILED
>     java.lang.AssertionError:
>     Expected size:<3> but was:<2> in:
>     <[/tmp/junit8723178147444223944/unzippedLogs/server-1,
>         /tmp/junit8723178147444223944/unzippedLogs/server-2]>
>         at org.apache.geode.management.internal.cli.commands.ExportLogsDUnitTest.verifyZipFileContents(ExportLogsDUnitTest.java:225)
>         at org.apache.geode.management.internal.cli.commands.ExportLogsDUnitTest.testExportWithStartAndEndDateTimeFiltering(ExportLogsDUnitTest.java:155)
> 303 tests completed, 1 failed, 8 skipped
> {noformat}



--
This message was sent by Atlassian JIRA
(v6.4.14#64029)

Mime
View raw message