geode-issues mailing list archives

Site index · List index
Message view « Date » · « Thread »
Top « Date » · « Thread »
From "Kirk Lund (JIRA)" <j...@apache.org>
Subject [jira] [Updated] (GEODE-1989) CI failure: SharedConfigurationUsingDirDUnitTest updateClusterConfigDirWithTwoLocatorsAndRollingServerRestart
Date Fri, 18 Nov 2016 00:56:58 GMT

     [ https://issues.apache.org/jira/browse/GEODE-1989?page=com.atlassian.jira.plugin.system.issuetabpanels:all-tabpanel
]

Kirk Lund updated GEODE-1989:
-----------------------------
    Labels: ci flaky  (was: ci)

> CI failure: SharedConfigurationUsingDirDUnitTest updateClusterConfigDirWithTwoLocatorsAndRollingServerRestart
> -------------------------------------------------------------------------------------------------------------
>
>                 Key: GEODE-1989
>                 URL: https://issues.apache.org/jira/browse/GEODE-1989
>             Project: Geode
>          Issue Type: Bug
>          Components: management
>            Reporter: Darrel Schneider
>              Labels: ci, flaky
>
> :geode-core:distributedTest
> org.apache.geode.management.internal.configuration.SharedConfigurationUsingDirDUnitTest
> updateClusterConfigDirWithTwoLocatorsAndRollingServerRestart FAILED
>     org.apache.geode.test.dunit.RMIException: While invoking org.apache.geode.test.dunit.NamedRunnable.run
in VM 2 running on Host a9e7f8bc8ba0 with 4 VMs
>         at org.apache.geode.test.dunit.VM.invoke(VM.java:389)
>         at org.apache.geode.test.dunit.VM.invoke(VM.java:355)
>         at org.apache.geode.test.dunit.VM.invoke(VM.java:280)
>         at org.apache.geode.management.internal.configuration.SharedConfigurationUsingDirDUnitTest.updateClusterConfigDirWithTwoLocatorsAndRollingServerRestart(SharedConfigurationUsingDirDUnitTest.java:208)
>         Caused by:
>         com.jayway.awaitility.core.ConditionTimeoutException: Condition with lambda expression
in org.apache.geode.management.internal.configuration.SharedConfigurationUsingDirDUnitTest
was not fulfilled within 15 seconds.
>             at com.jayway.awaitility.core.ConditionAwaiter.await(ConditionAwaiter.java:122)
>             at com.jayway.awaitility.core.CallableCondition.await(CallableCondition.java:79)
>             at com.jayway.awaitility.core.CallableCondition.await(CallableCondition.java:27)
>             at com.jayway.awaitility.core.ConditionFactory.until(ConditionFactory.java:764)
>             at com.jayway.awaitility.core.ConditionFactory.until(ConditionFactory.java:741)
>             at org.apache.geode.management.internal.configuration.SharedConfigurationUsingDirDUnitTest.lambda$updateClusterConfigDirWithTwoLocatorsAndRollingServerRestart$bb17a952$2(SharedConfigurationUsingDirDUnitTest.java:209)
> 7578 tests completed, 1 failed, 588 skipped



--
This message was sent by Atlassian JIRA
(v6.3.4#6332)

Mime
View raw message