geode-issues mailing list archives

Site index · List index
Message view « Date » · « Thread »
Top « Date » · « Thread »
From "ASF subversion and git services (JIRA)" <j...@apache.org>
Subject [jira] [Commented] (GEODE-2022) CI Failure: PRColocatedEquiJoinDUnitTest.testRRPRLocalQueryingWithHetroIndexes
Date Thu, 20 Oct 2016 20:52:58 GMT

    [ https://issues.apache.org/jira/browse/GEODE-2022?page=com.atlassian.jira.plugin.system.issuetabpanels:comment-tabpanel&focusedCommentId=15592973#comment-15592973
] 

ASF subversion and git services commented on GEODE-2022:
--------------------------------------------------------

Commit 7e659b2381eae3847d1c7e29bb1b37df518dde35 in incubator-geode's branch refs/heads/develop
from [~upthewaterspout]
[ https://git-wip-us.apache.org/repos/asf?p=incubator-geode.git;h=7e659b2 ]

GEODE-2022: Marking testRRPRLocalQueryingWithHetroIndexes as flaky


> CI Failure: PRColocatedEquiJoinDUnitTest.testRRPRLocalQueryingWithHetroIndexes
> ------------------------------------------------------------------------------
>
>                 Key: GEODE-2022
>                 URL: https://issues.apache.org/jira/browse/GEODE-2022
>             Project: Geode
>          Issue Type: Bug
>          Components: querying
>            Reporter: Dan Smith
>
> This test failed in a precheckin run with revision e130e5b62bcb2d3c561be90f46407dc49f100b4a
> {noformat}
> org.apache.geode.test.dunit.RMIException: While invoking org.apache.geode.cache.query.partitioned.PRQueryDUnitHelper$33.run
in VM 0 running on Host f83af001cb71 with 4 VMs
> 	at org.apache.geode.test.dunit.VM.invoke(VM.java:389)
> 	at org.apache.geode.test.dunit.VM.invoke(VM.java:355)
> 	at org.apache.geode.test.dunit.VM.invoke(VM.java:293)
> 	at org.apache.geode.cache.query.partitioned.PRColocatedEquiJoinDUnitTest.testRRPRLocalQueryingWithHetroIndexes(PRColocatedEquiJoinDUnitTest.java:1419)
> 	at sun.reflect.NativeMethodAccessorImpl.invoke0(Native Method)
> 	at sun.reflect.NativeMethodAccessorImpl.invoke(NativeMethodAccessorImpl.java:62)
> 	at sun.reflect.DelegatingMethodAccessorImpl.invoke(DelegatingMethodAccessorImpl.java:43)
> 	at java.lang.reflect.Method.invoke(Method.java:498)
> 	at org.junit.runners.model.FrameworkMethod$1.runReflectiveCall(FrameworkMethod.java:50)
> 	at org.junit.internal.runners.model.ReflectiveCallable.run(ReflectiveCallable.java:12)
> 	at org.junit.runners.model.FrameworkMethod.invokeExplosively(FrameworkMethod.java:47)
> 	at org.junit.internal.runners.statements.InvokeMethod.evaluate(InvokeMethod.java:17)
> 	at org.junit.internal.runners.statements.RunBefores.evaluate(RunBefores.java:26)
> 	at org.junit.internal.runners.statements.RunAfters.evaluate(RunAfters.java:27)
> 	at org.junit.rules.TestWatcher$1.evaluate(TestWatcher.java:55)
> 	at org.junit.rules.RunRules.evaluate(RunRules.java:20)
> 	at org.junit.runners.ParentRunner.runLeaf(ParentRunner.java:325)
> 	at org.junit.runners.BlockJUnit4ClassRunner.runChild(BlockJUnit4ClassRunner.java:78)
> 	at org.junit.runners.BlockJUnit4ClassRunner.runChild(BlockJUnit4ClassRunner.java:57)
> 	at org.junit.runners.ParentRunner$3.run(ParentRunner.java:290)
> 	at org.junit.runners.ParentRunner$1.schedule(ParentRunner.java:71)
> 	at org.junit.runners.ParentRunner.runChildren(ParentRunner.java:288)
> 	at org.junit.runners.ParentRunner.access$000(ParentRunner.java:58)
> 	at org.junit.runners.ParentRunner$2.evaluate(ParentRunner.java:268)
> 	at org.junit.internal.runners.statements.RunBefores.evaluate(RunBefores.java:26)
> 	at org.junit.internal.runners.statements.RunAfters.evaluate(RunAfters.java:27)
> 	at org.junit.runners.ParentRunner.run(ParentRunner.java:363)
> 	at org.gradle.api.internal.tasks.testing.junit.JUnitTestClassExecuter.runTestClass(JUnitTestClassExecuter.java:114)
> 	at org.gradle.api.internal.tasks.testing.junit.JUnitTestClassExecuter.execute(JUnitTestClassExecuter.java:57)
> 	at org.gradle.api.internal.tasks.testing.junit.JUnitTestClassProcessor.processTestClass(JUnitTestClassProcessor.java:66)
> 	at org.gradle.api.internal.tasks.testing.SuiteTestClassProcessor.processTestClass(SuiteTestClassProcessor.java:51)
> 	at sun.reflect.NativeMethodAccessorImpl.invoke0(Native Method)
> 	at sun.reflect.NativeMethodAccessorImpl.invoke(NativeMethodAccessorImpl.java:62)
> 	at sun.reflect.DelegatingMethodAccessorImpl.invoke(DelegatingMethodAccessorImpl.java:43)
> 	at java.lang.reflect.Method.invoke(Method.java:498)
> 	at org.gradle.internal.dispatch.ReflectionDispatch.dispatch(ReflectionDispatch.java:35)
> 	at org.gradle.internal.dispatch.ReflectionDispatch.dispatch(ReflectionDispatch.java:24)
> 	at org.gradle.internal.dispatch.ContextClassLoaderDispatch.dispatch(ContextClassLoaderDispatch.java:32)
> 	at org.gradle.internal.dispatch.ProxyDispatchAdapter$DispatchingInvocationHandler.invoke(ProxyDispatchAdapter.java:93)
> 	at com.sun.proxy.$Proxy2.processTestClass(Unknown Source)
> 	at org.gradle.api.internal.tasks.testing.worker.TestWorker.processTestClass(TestWorker.java:109)
> 	at sun.reflect.NativeMethodAccessorImpl.invoke0(Native Method)
> 	at sun.reflect.NativeMethodAccessorImpl.invoke(NativeMethodAccessorImpl.java:62)
> 	at sun.reflect.DelegatingMethodAccessorImpl.invoke(DelegatingMethodAccessorImpl.java:43)
> 	at java.lang.reflect.Method.invoke(Method.java:498)
> 	at org.gradle.internal.dispatch.ReflectionDispatch.dispatch(ReflectionDispatch.java:35)
> 	at org.gradle.internal.dispatch.ReflectionDispatch.dispatch(ReflectionDispatch.java:24)
> 	at org.gradle.internal.remote.internal.hub.MessageHub$Handler.run(MessageHub.java:377)
> 	at org.gradle.internal.concurrent.ExecutorPolicy$CatchAndRecordFailures.onExecute(ExecutorPolicy.java:54)
> 	at org.gradle.internal.concurrent.StoppableExecutorImpl$1.run(StoppableExecutorImpl.java:40)
> 	at java.util.concurrent.ThreadPoolExecutor.runWorker(ThreadPoolExecutor.java:1142)
> 	at java.util.concurrent.ThreadPoolExecutor$Worker.run(ThreadPoolExecutor.java:617)
> 	at java.lang.Thread.run(Thread.java:745)
> Caused by: java.lang.AssertionError: FAILED:SelectResults size is different in both the
cases. Size1=364 Size2 = 400; failed query=r1.ID = r2.id
> 	at org.junit.Assert.fail(Assert.java:88)
> 	at org.apache.geode.cache.query.functional.StructSetOrResultsSet.checkResultSizes(StructSetOrResultsSet.java:383)
> 	at org.apache.geode.cache.query.functional.StructSetOrResultsSet.compareQueryResultLists(StructSetOrResultsSet.java:367)
> 	at org.apache.geode.cache.query.functional.StructSetOrResultsSet.CompareQueryResultsAsListWithoutAndWithIndexes(StructSetOrResultsSet.java:349)
> 	at org.apache.geode.cache.query.partitioned.PRQueryDUnitHelper$33.run2(PRQueryDUnitHelper.java:2397)
> 	at org.apache.geode.cache30.CacheSerializableRunnable.run(CacheSerializableRunnable.java:60)
> 	at sun.reflect.GeneratedMethodAccessor58.invoke(Unknown Source)
> 	at sun.reflect.DelegatingMethodAccessorImpl.invoke(DelegatingMethodAccessorImpl.java:43)
> 	at java.lang.reflect.Method.invoke(Method.java:498)
> 	at hydra.MethExecutor.executeObject(MethExecutor.java:268)
> 	at org.apache.geode.test.dunit.standalone.RemoteDUnitVM.executeMethodOnObject(RemoteDUnitVM.java:82)
> 	at sun.reflect.GeneratedMethodAccessor52.invoke(Unknown Source)
> 	at sun.reflect.DelegatingMethodAccessorImpl.invoke(DelegatingMethodAccessorImpl.java:43)
> 	at java.lang.reflect.Method.invoke(Method.java:498)
> 	at sun.rmi.server.UnicastServerRef.dispatch(UnicastServerRef.java:324)
> 	at sun.rmi.transport.Transport$1.run(Transport.java:200)
> 	at sun.rmi.transport.Transport$1.run(Transport.java:197)
> 	at java.security.AccessController.doPrivileged(Native Method)
> 	at sun.rmi.transport.Transport.serviceCall(Transport.java:196)
> 	at sun.rmi.transport.tcp.TCPTransport.handleMessages(TCPTransport.java:568)
> 	at sun.rmi.transport.tcp.TCPTransport$ConnectionHandler.run0(TCPTransport.java:826)
> 	at sun.rmi.transport.tcp.TCPTransport$ConnectionHandler.lambda$run$0(TCPTransport.java:683)
> 	at java.security.AccessController.doPrivileged(Native Method)
> 	at sun.rmi.transport.tcp.TCPTransport$ConnectionHandler.run(TCPTransport.java:682)
> 	... 3 more
> Previously run tests: [PRColocatedEquiJoinDUnitTest]
> {noformat}



--
This message was sent by Atlassian JIRA
(v6.3.4#6332)

Mime
View raw message