geode-issues mailing list archives

Site index · List index
Message view « Date » · « Thread »
Top « Date » · « Thread »
From "Bruce Schuchardt (JIRA)" <j...@apache.org>
Subject [jira] [Updated] (GEODE-1957) CI failure: DiskRegionAsyncRecoveryJUnitTest.testCloseOpenRegion
Date Fri, 30 Sep 2016 20:35:21 GMT

     [ https://issues.apache.org/jira/browse/GEODE-1957?page=com.atlassian.jira.plugin.system.issuetabpanels:all-tabpanel
]

Bruce Schuchardt updated GEODE-1957:
------------------------------------
    Description: 
This test failed in a CI run with SHA 7254cf3fb0ceb2255650d96f2b0ed615118ef700

{noformat}
org.apache.geode.internal.cache.DiskRegionAsyncRecoveryJUnitTest > testCloseOpenRegion
FAILED
    java.lang.AssertionError: Failed on entry 40 expected:<A> but was:<null>
        at org.junit.Assert.fail(Assert.java:88)
        at org.junit.Assert.failNotEquals(Assert.java:834)
        at org.junit.Assert.assertEquals(Assert.java:118)
        at org.apache.geode.internal.cache.DiskRegionAsyncRecoveryJUnitTest.checkEntriesInMemory(DiskRegionAsyncRecoveryJUnitTest.java:456)
        at org.apache.geode.internal.cache.DiskRegionAsyncRecoveryJUnitTest.testCloseOpenRegion(DiskRegionAsyncRecoveryJUnitTest.java:382)
{noformat}


  was:
This test failed in a CI run with SHA 

{noformat}
org.apache.geode.internal.cache.DiskRegionAsyncRecoveryJUnitTest > testCloseOpenRegion
FAILED
    java.lang.AssertionError: Failed on entry 40 expected:<A> but was:<null>
        at org.junit.Assert.fail(Assert.java:88)
        at org.junit.Assert.failNotEquals(Assert.java:834)
        at org.junit.Assert.assertEquals(Assert.java:118)
        at org.apache.geode.internal.cache.DiskRegionAsyncRecoveryJUnitTest.checkEntriesInMemory(DiskRegionAsyncRecoveryJUnitTest.java:456)
        at org.apache.geode.internal.cache.DiskRegionAsyncRecoveryJUnitTest.testCloseOpenRegion(DiskRegionAsyncRecoveryJUnitTest.java:382)
{noformat}



> CI failure: DiskRegionAsyncRecoveryJUnitTest.testCloseOpenRegion
> ----------------------------------------------------------------
>
>                 Key: GEODE-1957
>                 URL: https://issues.apache.org/jira/browse/GEODE-1957
>             Project: Geode
>          Issue Type: Bug
>          Components: regions
>            Reporter: Bruce Schuchardt
>              Labels: ci
>
> This test failed in a CI run with SHA 7254cf3fb0ceb2255650d96f2b0ed615118ef700
> {noformat}
> org.apache.geode.internal.cache.DiskRegionAsyncRecoveryJUnitTest > testCloseOpenRegion
FAILED
>     java.lang.AssertionError: Failed on entry 40 expected:<A> but was:<null>
>         at org.junit.Assert.fail(Assert.java:88)
>         at org.junit.Assert.failNotEquals(Assert.java:834)
>         at org.junit.Assert.assertEquals(Assert.java:118)
>         at org.apache.geode.internal.cache.DiskRegionAsyncRecoveryJUnitTest.checkEntriesInMemory(DiskRegionAsyncRecoveryJUnitTest.java:456)
>         at org.apache.geode.internal.cache.DiskRegionAsyncRecoveryJUnitTest.testCloseOpenRegion(DiskRegionAsyncRecoveryJUnitTest.java:382)
> {noformat}



--
This message was sent by Atlassian JIRA
(v6.3.4#6332)

Mime
View raw message