geode-issues mailing list archives

Site index · List index
Message view « Date » · « Thread »
Top « Date » · « Thread »
From "Mark Bretl (JIRA)" <j...@apache.org>
Subject [jira] [Commented] (GEODE-112) Geode Jenkins runs out of memory when archiving test reports
Date Tue, 28 Jul 2015 00:07:05 GMT

    [ https://issues.apache.org/jira/browse/GEODE-112?page=com.atlassian.jira.plugin.system.issuetabpanels:comment-tabpanel&focusedCommentId=14643639#comment-14643639
] 

Mark Bretl commented on GEODE-112:
----------------------------------

INFRA ticket now created. https://issues.apache.org/jira/browse/INFRA-10053

> Geode Jenkins runs out of memory when archiving test reports
> ------------------------------------------------------------
>
>                 Key: GEODE-112
>                 URL: https://issues.apache.org/jira/browse/GEODE-112
>             Project: Geode
>          Issue Type: Bug
>          Components: build
>            Reporter: Kirk Lund
>            Assignee: Mark Bretl
>              Labels: build
>
> Jenkins intermittently runs out of memory when archiving test reports for Geode:
> {code}
> BUILD FAILED
> Total time: 7 hrs 7 mins 57.659 secs
> Build step 'Execute shell' marked build as failure
> Archiving artifacts
> Sending artifact delta relative to Geode-nightly #122
> Archived 2 artifacts
> Archive block size is 32768
> Received 1493 blocks and 128755578 bytes
> Compression is 27.5%
> Took 39 sec
> Recording test results
> ERROR: Failed to archive test reports
> java.io.IOException: remote file operation failed: /home/jenkins/jenkins-slave/workspace/Geode-nightly
at hudson.remoting.Channel@18a56604:ubuntu-1
> 	at hudson.FilePath.act(FilePath.java:916)
> 	at hudson.FilePath.act(FilePath.java:893)
> 	at hudson.tasks.junit.JUnitParser.parse(JUnitParser.java:87)
> 	at hudson.tasks.junit.JUnitResultArchiver.parse(JUnitResultArchiver.java:117)
> 	at hudson.tasks.junit.JUnitResultArchiver.perform(JUnitResultArchiver.java:129)
> 	at hudson.tasks.BuildStepMonitor$1.perform(BuildStepMonitor.java:20)
> 	at hudson.model.AbstractBuild$AbstractBuildExecution.perform(AbstractBuild.java:756)
> 	at hudson.model.AbstractBuild$AbstractBuildExecution.performAllBuildSteps(AbstractBuild.java:720)
> 	at hudson.model.Build$BuildExecution.post2(Build.java:182)
> 	at hudson.model.AbstractBuild$AbstractBuildExecution.post(AbstractBuild.java:669)
> 	at hudson.model.Run.execute(Run.java:1731)
> 	at hudson.model.FreeStyleBuild.run(FreeStyleBuild.java:43)
> 	at hudson.model.ResourceController.execute(ResourceController.java:88)
> 	at hudson.model.Executor.run(Executor.java:232)
> Caused by: java.io.IOException: Remote call on ubuntu-1 failed
> 	at hudson.remoting.Channel.call(Channel.java:751)
> 	at hudson.FilePath.act(FilePath.java:909)
> 	... 13 more
> Caused by: java.lang.OutOfMemoryError: Java heap space
> 	at java.util.Arrays.copyOfRange(Arrays.java:2694)
> 	at java.lang.String.<init>(String.java:203)
> 	at org.dom4j.io.SAXContentHandler.characters(SAXContentHandler.java:293)
> 	at com.sun.org.apache.xerces.internal.parsers.AbstractSAXParser.characters(AbstractSAXParser.java:546)
> 	at com.sun.org.apache.xerces.internal.impl.XMLDocumentFragmentScannerImpl.scanDocument(XMLDocumentFragmentScannerImpl.java:488)
> 	at com.sun.org.apache.xerces.internal.parsers.XML11Configuration.parse(XML11Configuration.java:848)
> 	at com.sun.org.apache.xerces.internal.parsers.XML11Configuration.parse(XML11Configuration.java:777)
> 	at com.sun.org.apache.xerces.internal.parsers.XMLParser.parse(XMLParser.java:141)
> 	at com.sun.org.apache.xerces.internal.parsers.AbstractSAXParser.parse(AbstractSAXParser.java:1213)
> 	at com.sun.org.apache.xerces.internal.jaxp.SAXParserImpl$JAXPSAXParser.parse(SAXParserImpl.java:649)
> 	at org.dom4j.io.SAXReader.read(SAXReader.java:465)
> 	at org.dom4j.io.SAXReader.read(SAXReader.java:264)
> 	at hudson.tasks.junit.SuiteResult.parse(SuiteResult.java:123)
> 	at hudson.tasks.junit.TestResult.parse(TestResult.java:273)
> 	at hudson.tasks.junit.TestResult.parsePossiblyEmpty(TestResult.java:229)
> 	at hudson.tasks.junit.TestResult.parse(TestResult.java:164)
> 	at hudson.tasks.junit.TestResult.parse(TestResult.java:147)
> 	at hudson.tasks.junit.TestResult.<init>(TestResult.java:123)
> 	at hudson.tasks.junit.JUnitParser$ParseResultCallable.invoke(JUnitParser.java:117)
> 	at hudson.tasks.junit.JUnitParser$ParseResultCallable.invoke(JUnitParser.java:90)
> 	at hudson.FilePath$FileCallableWrapper.call(FilePath.java:2474)
> 	at hudson.remoting.UserRequest.perform(UserRequest.java:118)
> 	at hudson.remoting.UserRequest.perform(UserRequest.java:48)
> 	at hudson.remoting.Request$2.run(Request.java:328)
> 	at hudson.remoting.InterceptingExecutorService$1.call(InterceptingExecutorService.java:72)
> 	at java.util.concurrent.FutureTask.run(FutureTask.java:262)
> 	at java.util.concurrent.ThreadPoolExecutor.runWorker(ThreadPoolExecutor.java:1145)
> 	at java.util.concurrent.ThreadPoolExecutor$Worker.run(ThreadPoolExecutor.java:615)
> 	at java.lang.Thread.run(Thread.java:745)
> Sending e-mails to: dev@geode.incubator.apache.org dschneider@pivotal.io klund@pivotal.io
vbhaskar@pivotal.io jhuynh@Jason-Huynh-MacBook-Pro.local dsmith@pivotal.io
> Finished: FAILURE
> {code}



--
This message was sent by Atlassian JIRA
(v6.3.4#6332)

Mime
View raw message