geode-dev mailing list archives

Site index · List index
Message view « Date » · « Thread »
Top « Date » · « Thread »
From Kirk Lund <kl...@apache.org>
Subject RED ALERT: EvictionDUnitTest failed again DistributedTestOpenJDK8 #101
Date Sat, 10 Nov 2018 00:10:57 GMT
GEODE-5943: EvictionDUnitTest failed in jdk11

https://issues.apache.org/jira/browse/GEODE-5943

https://concourse.apachegeode-ci.info/teams/main/pipelines/apache-develop-main/jobs/DistributedTestOpenJDK8/builds/101

org.apache.geode.internal.cache.eviction.EvictionDUnitTest >
testDummyInlineNCentralizedEviction[offHeap=false] FAILED
    org.apache.geode.test.dunit.RMIException: While invoking
org.apache.geode.internal.cache.eviction.EvictionDUnitTest$$Lambda$59/926122170.call
in VM 1 running on Host d55391503e0b with 4 VMs
        at org.apache.geode.test.dunit.VM.invoke(VM.java:433)
        at org.apache.geode.test.dunit.VM.invoke(VM.java:402)
        at org.apache.geode.test.dunit.VM.invoke(VM.java:384)
        at
org.apache.geode.test.junit.rules.VMProvider.invoke(VMProvider.java:74)
        at
org.apache.geode.internal.cache.eviction.EvictionDUnitTest.testDummyInlineNCentralizedEviction(EvictionDUnitTest.java:125)

        Caused by:
        org.awaitility.core.ConditionTimeoutException: Condition with
lambda expression in
org.apache.geode.internal.cache.eviction.EvictionDUnitTest that uses
org.apache.geode.internal.cache.LocalRegion,
org.apache.geode.internal.cache.LocalRegionint was not fulfilled within 300
seconds.
            at
org.awaitility.core.ConditionAwaiter.await(ConditionAwaiter.java:145)
            at
org.awaitility.core.CallableCondition.await(CallableCondition.java:79)
            at
org.awaitility.core.CallableCondition.await(CallableCondition.java:27)
            at
org.awaitility.core.ConditionFactory.until(ConditionFactory.java:890)
            at
org.awaitility.core.ConditionFactory.until(ConditionFactory.java:848)
            at
org.apache.geode.internal.cache.eviction.EvictionDUnitTest.sendEventAndWaitForExpectedEviction(EvictionDUnitTest.java:249)
            at
org.apache.geode.internal.cache.eviction.EvictionDUnitTest.lambda$testDummyInlineNCentralizedEviction$7d47808e$1(EvictionDUnitTest.java:125)

8210 tests completed, 1 failed, 494 skipped

> Task :geode-core:distributedTest FAILED

Mime
  • Unnamed multipart/alternative (inline, None, 0 bytes)
View raw message