geode-dev mailing list archives

Site index · List index
Message view « Date » · « Thread »
Top « Date » · « Thread »
From Apache Jenkins Server <jenk...@builds.apache.org>
Subject Build failed in Jenkins: Geode-nightly #1275
Date Tue, 31 Jul 2018 03:56:17 GMT
See <https://builds.apache.org/job/Geode-nightly/1275/display/redirect?page=changes>

Changes:

[github] GEODE-5476: Reduce build output while preserving some sense of progress.

[github] GEODE-5464: Generify DistributionManager and related classes (#2174)

[dsmith] GEODE-5443: removing uiTests from the CI

[dschneider] GEODE-5437: change async region gii to be synchronous (#2219)

[jbarrett] GEODE-5492 Fix gradle dependencies to enable reliable parallel build

[jbarrett] GEODE-5496 create reaper pipeline (#2224)

[github] GEODE-5490: Moves backwards compatibility tests in to upgradeTest.

[jbarrett] GEODE-5490: Update metrics to drop flaky and include upgrade test.

[jbarrett] GEODE-5503: Reorganized to decrease overhead wait times.

[jbarrett] GEODE-5503: Fixes resource name.

[jbarrett] GEODE-5503: Use image_resource

[jbarrett] GEODE-5503: Fixes image_resource

[jbarrett] GEODE-5503: Fixes image_resource

[jbarrett] GEODE-5503: Reduce overhead wait time on main pipeline.

[jbarrett] GEODE-5503: Fixes dependency ordering.

[jbarrett] GEODE-5503: Remove prepopulate_build since parallel build is fixed.

------------------------------------------
[...truncated 171.25 KB...]
> Task :geode-json:processAcceptanceTestResources NO-SOURCE
> Task :geode-json:acceptanceTestClasses UP-TO-DATE
> Task :geode-json:assemble
> Task :geode-json:spotlessJava
> Task :geode-json:spotlessJavaCheck
> Task :geode-json:spotlessCheck
> Task :geode-json:test NO-SOURCE
> Task :geode-json:check
> Task :geode-json:processDistributedTestResources NO-SOURCE
> Task :geode-json:distributedTestClasses UP-TO-DATE
> Task :geode-json:processIntegrationTestResources NO-SOURCE
> Task :geode-json:integrationTestClasses UP-TO-DATE
> Task :geode-json:processPerformanceTestResources NO-SOURCE
> Task :geode-json:performanceTestClasses UP-TO-DATE
> Task :geode-json:processUiTestResources NO-SOURCE
> Task :geode-json:uiTestClasses UP-TO-DATE
> Task :geode-json:processUpgradeTestResources NO-SOURCE
> Task :geode-json:upgradeTestClasses UP-TO-DATE
> Task :geode-json:build
> Task :geode-junit:processAcceptanceTestResources NO-SOURCE
> Task :geode-junit:acceptanceTestClasses UP-TO-DATE
> Task :geode-junit:javadocJar
> Task :geode-junit:sourcesJar
> Task :geode-junit:signArchives SKIPPED
> Task :geode-junit:assemble
> Task :geode-junit:spotlessJava
> Task :geode-junit:spotlessJavaCheck
> Task :geode-junit:spotlessCheck

> Task :geode-junit:test
Test Suite: org.apache.geode.test.dunit.standalone.VersionManagerJUnitTest: PASSED: 3
Test Suite: org.apache.geode.test.junit.rules.ExpectedTimeoutRuleTest: PASSED: 7
Test Suite: org.apache.geode.test.junit.rules.RepeatRuleTest: PASSED: 11
Test Suite: org.apache.geode.test.junit.rules.IgnoreUntilRuleTest: PASSED: 3
Test Suite: org.apache.geode.test.junit.rules.RuleListTest: PASSED: 1
Test Suite: org.apache.geode.test.junit.rules.serializable.SerializableRuleListTest: PASSED:
2
Test Suite: org.apache.geode.test.junit.rules.serializable.SerializableTemporaryFolderTest:
PASSED: 6
Test Suite: org.apache.geode.test.junit.rules.serializable.SerializableTimeoutTest: PASSED:
7
Test Suite: org.apache.geode.test.junit.rules.serializable.SerializableTestWatcherTest: PASSED:
3
Test Suite: org.apache.geode.test.junit.rules.serializable.SerializableTestNameTest: PASSED:
5
Test Suite: org.apache.geode.test.junit.rules.serializable.SerializableExternalResourceTest:
PASSED: 3
Test Suite: org.apache.geode.test.junit.rules.ExecutorServiceRuleTest: PASSED: 8
Test Suite: org.apache.geode.test.junit.rules.RestoreLocaleRuleTest: PASSED: 4
Test Suite: org.apache.geode.test.junit.rules.RetryRuleLocalWithExceptionTest: PASSED: 6
Test Suite: org.apache.geode.test.junit.rules.examples.RepeatingTestCasesExampleTest: PASSED:
4
Test Suite: org.apache.geode.test.junit.rules.examples.RuleAndClassRuleTest: PASSED: 4
Test Suite: org.apache.geode.test.junit.rules.examples.RetryRuleExampleTest: PASSED: 1
Test Suite: org.apache.geode.test.junit.rules.RetryRuleGlobalWithErrorTest: PASSED: 8
Test Suite: org.apache.geode.test.junit.rules.RetryRuleGlobalWithExceptionTest: PASSED: 8
Test Suite: org.apache.geode.test.junit.rules.RetryRuleLocalWithErrorTest: PASSED: 6
Test Suite: org.apache.geode.test.junit.runners.CategoryWithParameterizedRunnerFactoryTest:
PASSED: 2
Test Suite: org.apache.geode.test.junit.categories.CategoryTest: PASSED: 1
Test Suite: org.apache.geode.test.compiler.UncompiledSourceCodeTest: PASSED: 2
Test Suite: org.apache.geode.test.compiler.ClassNameExtractorTest: PASSED: 1

> Task :geode-junit:check
> Task :geode-junit:processDistributedTestResources NO-SOURCE
> Task :geode-junit:distributedTestClasses UP-TO-DATE
> Task :geode-junit:processIntegrationTestResources NO-SOURCE
> Task :geode-junit:integrationTestClasses
> Task :geode-junit:processPerformanceTestResources NO-SOURCE
> Task :geode-junit:performanceTestClasses UP-TO-DATE
> Task :geode-junit:processUiTestResources NO-SOURCE
> Task :geode-junit:uiTestClasses UP-TO-DATE
> Task :geode-junit:processUpgradeTestResources NO-SOURCE
> Task :geode-junit:upgradeTestClasses UP-TO-DATE
> Task :geode-junit:build
> Task :geode-lucene:processAcceptanceTestResources NO-SOURCE
> Task :geode-lucene:assemble
> Task :geode-lucene:spotlessJava
> Task :geode-lucene:spotlessJavaCheck
> Task :geode-lucene:spotlessCheck
> Task :geode-lucene:processDistributedTestResources NO-SOURCE
> Task :geode-lucene:processIntegrationTestResources
> Task :geode-lucene:processPerformanceTestResources NO-SOURCE
> Task :geode-lucene:processUiTestResources NO-SOURCE
> Task :geode-lucene:processUpgradeTestResources NO-SOURCE
> Task :geode-old-client-support:processAcceptanceTestResources NO-SOURCE
> Task :geode-old-client-support:assemble
> Task :geode-old-client-support:spotlessJava
> Task :geode-old-client-support:spotlessJavaCheck
> Task :geode-old-client-support:spotlessCheck
> Task :geode-old-client-support:processDistributedTestResources NO-SOURCE
> Task :geode-old-client-support:processIntegrationTestResources NO-SOURCE
> Task :geode-old-client-support:processPerformanceTestResources NO-SOURCE
> Task :geode-old-client-support:processUiTestResources NO-SOURCE
> Task :geode-old-client-support:processUpgradeTestResources NO-SOURCE
> Task :geode-old-versions:processAcceptanceTestResources NO-SOURCE
> Task :geode-old-versions:acceptanceTestClasses UP-TO-DATE
> Task :geode-old-versions:javadocJar
> Task :geode-old-versions:sourcesJar
> Task :geode-old-versions:signArchives SKIPPED
> Task :geode-old-versions:assemble
> Task :geode-old-versions:spotlessJava
> Task :geode-old-versions:spotlessJavaCheck
> Task :geode-old-versions:spotlessCheck
> Task :geode-old-versions:test NO-SOURCE
> Task :geode-old-versions:check
> Task :geode-old-versions:processDistributedTestResources NO-SOURCE
> Task :geode-old-versions:distributedTestClasses UP-TO-DATE
> Task :geode-old-versions:processIntegrationTestResources NO-SOURCE
> Task :geode-old-versions:integrationTestClasses UP-TO-DATE
> Task :geode-old-versions:processPerformanceTestResources NO-SOURCE
> Task :geode-old-versions:performanceTestClasses UP-TO-DATE
> Task :geode-old-versions:processUiTestResources NO-SOURCE
> Task :geode-old-versions:uiTestClasses UP-TO-DATE
> Task :geode-old-versions:processUpgradeTestResources NO-SOURCE
> Task :geode-old-versions:upgradeTestClasses UP-TO-DATE
> Task :geode-old-versions:build
> Task :geode-protobuf:processAcceptanceTestResources NO-SOURCE
> Task :geode-protobuf:assemble
> Task :geode-protobuf:spotlessJava
> Task :geode-protobuf:spotlessJavaCheck
> Task :geode-protobuf:spotlessCheck
> Task :geode-protobuf:processDistributedTestResources NO-SOURCE
> Task :geode-protobuf:processIntegrationTestResources NO-SOURCE
> Task :geode-protobuf:processPerformanceTestResources NO-SOURCE
> Task :geode-protobuf:processUiTestResources NO-SOURCE
> Task :geode-protobuf:processUpgradeTestResources NO-SOURCE
> Task :geode-protobuf-messages:processAcceptanceTestResources NO-SOURCE
> Task :geode-protobuf-messages:acceptanceTestClasses UP-TO-DATE
> Task :geode-protobuf-messages:assemble
> Task :geode-protobuf-messages:spotlessJava
> Task :geode-protobuf-messages:spotlessJavaCheck
> Task :geode-protobuf-messages:spotlessCheck
> Task :geode-protobuf-messages:test NO-SOURCE
> Task :geode-protobuf-messages:check
> Task :geode-protobuf-messages:processDistributedTestResources NO-SOURCE
> Task :geode-protobuf-messages:distributedTestClasses UP-TO-DATE
> Task :geode-protobuf-messages:processIntegrationTestResources NO-SOURCE
> Task :geode-protobuf-messages:integrationTestClasses UP-TO-DATE
> Task :geode-protobuf-messages:processPerformanceTestResources NO-SOURCE
> Task :geode-protobuf-messages:performanceTestClasses UP-TO-DATE
> Task :geode-protobuf-messages:processUiTestResources NO-SOURCE
> Task :geode-protobuf-messages:uiTestClasses UP-TO-DATE
> Task :geode-protobuf-messages:processUpgradeTestResources NO-SOURCE
> Task :geode-protobuf-messages:upgradeTestClasses UP-TO-DATE
> Task :geode-protobuf-messages:build
> Task :geode-pulse:processAcceptanceTestResources NO-SOURCE
> Task :geode-pulse:assemble
> Task :geode-pulse:spotlessJava
> Task :geode-pulse:spotlessJavaCheck
> Task :geode-pulse:spotlessCheck
> Task :geode-pulse:processDistributedTestResources NO-SOURCE
> Task :geode-pulse:processIntegrationTestResources NO-SOURCE
> Task :geode-pulse:processPerformanceTestResources NO-SOURCE
> Task :geode-pulse:processUiTestResources NO-SOURCE
> Task :geode-pulse:processUpgradeTestResources NO-SOURCE
> Task :geode-rebalancer:processAcceptanceTestResources NO-SOURCE
> Task :geode-rebalancer:acceptanceTestClasses UP-TO-DATE
> Task :geode-rebalancer:assemble
> Task :geode-rebalancer:spotlessJava
> Task :geode-rebalancer:spotlessJavaCheck
> Task :geode-rebalancer:spotlessCheck
> Task :geode-rebalancer:test NO-SOURCE
> Task :geode-rebalancer:check
> Task :geode-rebalancer:processDistributedTestResources NO-SOURCE
> Task :geode-rebalancer:distributedTestClasses UP-TO-DATE
> Task :geode-rebalancer:processIntegrationTestResources NO-SOURCE
> Task :geode-rebalancer:processPerformanceTestResources NO-SOURCE
> Task :geode-rebalancer:performanceTestClasses UP-TO-DATE
> Task :geode-rebalancer:processUiTestResources NO-SOURCE
> Task :geode-rebalancer:uiTestClasses UP-TO-DATE
> Task :geode-rebalancer:processUpgradeTestResources NO-SOURCE
> Task :geode-rebalancer:upgradeTestClasses UP-TO-DATE
> Task :geode-wan:processAcceptanceTestResources NO-SOURCE
> Task :geode-wan:assemble
> Task :geode-wan:spotlessJava
> Task :geode-wan:spotlessJavaCheck
> Task :geode-wan:spotlessCheck
> Task :geode-wan:processDistributedTestResources NO-SOURCE
> Task :geode-wan:processIntegrationTestResources
> Task :geode-wan:processPerformanceTestResources NO-SOURCE
> Task :geode-wan:processUiTestResources NO-SOURCE
> Task :geode-wan:processUpgradeTestResources NO-SOURCE
> Task :geode-web:processAcceptanceTestResources NO-SOURCE
> Task :geode-web:assemble
> Task :geode-web:spotlessJava
> Task :geode-web:spotlessJavaCheck
> Task :geode-web:spotlessCheck
> Task :geode-web:processDistributedTestResources NO-SOURCE
> Task :geode-web:processIntegrationTestResources NO-SOURCE
> Task :geode-web:processPerformanceTestResources NO-SOURCE
> Task :geode-web:processUiTestResources NO-SOURCE
> Task :geode-web:processUpgradeTestResources NO-SOURCE
> Task :geode-web-api:processAcceptanceTestResources NO-SOURCE
> Task :geode-web-api:assemble
> Task :geode-web-api:spotlessJava
> Task :geode-web-api:spotlessJavaCheck
> Task :geode-web-api:spotlessCheck
> Task :geode-web-api:processDistributedTestResources NO-SOURCE
> Task :geode-web-api:processIntegrationTestResources
> Task :geode-web-api:processPerformanceTestResources NO-SOURCE
> Task :geode-web-api:processUiTestResources NO-SOURCE
> Task :geode-web-api:processUpgradeTestResources NO-SOURCE

> Task :combineReports
All test reports at <https://builds.apache.org/job/Geode-nightly/ws/build/reports/combined>

> Task :extensions/geode-modules:uploadArchives SKIPPED
> Task :extensions/geode-modules-assembly:uploadArchives SKIPPED
> Task :extensions/geode-modules-session:uploadArchives SKIPPED
> Task :extensions/geode-modules-session-internal:uploadArchives SKIPPED
> Task :extensions/geode-modules-tomcat7:uploadArchives SKIPPED
> Task :extensions/geode-modules-tomcat8:uploadArchives SKIPPED
> Task :extensions/session-testing-war:uploadArchives SKIPPED
> Task :geode-assembly:uploadArchives
> Task :geode-common:uploadArchives
> Task :geode-concurrency-test:uploadArchives
> Task :geode-connectors:uploadArchives
> Task :geode-core:uploadArchives
> Task :geode-cq:uploadArchives
> Task :geode-experimental-driver:uploadArchives
> Task :geode-json:uploadArchives
> Task :geode-junit:uploadArchives
> Task :geode-lucene:uploadArchives
> Task :geode-old-client-support:uploadArchives
> Task :geode-old-versions:uploadArchives SKIPPED
> Task :geode-protobuf:uploadArchives
> Task :geode-protobuf-messages:uploadArchives
> Task :geode-pulse:uploadArchives
> Task :geode-rebalancer:uploadArchives
> Task :geode-wan:uploadArchives
> Task :geode-web:uploadArchives
> Task :geode-web-api:uploadArchives

FAILURE: Build failed with an exception.

* What went wrong:
Execution failed for task ':geode-core:compileTestJava'.
> Compilation failed; see the compiler error output for details.

* Try:
Run with --stacktrace option to get the stack trace. Run with --info or --debug option to
get more log output. Run with --scan to get full insights.

* Get more help at https://help.gradle.org

Deprecated Gradle features were used in this build, making it incompatible with Gradle 5.0.
See https://docs.gradle.org/4.8/userguide/command_line_interface.html#sec:command_line_warnings

BUILD FAILED in 12m 12s
280 actionable tasks: 279 executed, 1 up-to-date
Build step 'Invoke Gradle script' changed build result to FAILURE
Build step 'Invoke Gradle script' marked build as failure
Archiving artifacts
[Fast Archiver] Compressed 363.18 MB of artifacts by 42.7% relative to #1274
Recording test results
Not sending mail to unregistered user dsmith@pivotal.io
Not sending mail to unregistered user noreply@github.com

Mime
View raw message