geode-dev mailing list archives

Site index · List index
Message view « Date » · « Thread »
Top « Date » · « Thread »
From Apache Jenkins Server <jenk...@builds.apache.org>
Subject Build failed in Jenkins: Geode-nightly #1238
Date Thu, 28 Jun 2018 04:36:17 GMT
See <https://builds.apache.org/job/Geode-nightly/1238/display/redirect?page=changes>

Changes:

[github] GEODE-5346: Fix race in LauncherLifecycleCommandsDUnitTest (#2080)

[bschuchardt] GEODE-1198 CI Failure: DistributedSystemDUnitTest.testConflictingUDPPort

------------------------------------------
[...truncated 29.24 KB...]

> Task :geode-connectors:compileTestJava
Note: <https://builds.apache.org/job/Geode-nightly/ws/geode-connectors/src/test/java/org/apache/geode/connectors/jdbc/internal/cli/JDBCConnectorFunctionsSecurityTest.java>
uses or overrides a deprecated API.
Note: Recompile with -Xlint:deprecation for details.
Note: Some input files use unchecked or unsafe operations.
Note: Recompile with -Xlint:unchecked for details.

> Task :geode-connectors:processTestResources
> Task :geode-connectors:testClasses
> Task :geode-connectors:checkMissedTests
> Task :geode-connectors:spotlessJava UP-TO-DATE
> Task :geode-connectors:spotlessJavaCheck UP-TO-DATE
> Task :geode-connectors:spotlessCheck UP-TO-DATE
> Task :geode-connectors:test
> Task :geode-core:assemble
> Task :geode-core:checkMissedTests
> Task :geode-core:spotlessJava
> Task :geode-core:spotlessJavaCheck
> Task :geode-core:spotlessCheck
> Task :geode-core:test
> Task :geode-cq:assemble

> Task :geode-cq:compileTestJava
Note: Some input files use or override a deprecated API.
Note: Recompile with -Xlint:deprecation for details.
Note: Some input files use unchecked or unsafe operations.
Note: Recompile with -Xlint:unchecked for details.

> Task :geode-cq:processTestResources
> Task :geode-cq:testClasses
> Task :geode-cq:checkMissedTests
> Task :geode-cq:spotlessJava UP-TO-DATE
> Task :geode-cq:spotlessJavaCheck UP-TO-DATE
> Task :geode-cq:spotlessCheck UP-TO-DATE
> Task :geode-cq:test
> Task :geode-experimental-driver:jar
> Task :geode-experimental-driver:javadoc FROM-CACHE
> Task :geode-experimental-driver:javadocJar
> Task :geode-experimental-driver:sourcesJar
> Task :geode-experimental-driver:signArchives SKIPPED
> Task :geode-experimental-driver:assemble

> Task :geode-experimental-driver:compileTestJava
Note: Some input files use unchecked or unsafe operations.
Note: Recompile with -Xlint:unchecked for details.

> Task :geode-experimental-driver:processTestResources
> Task :geode-experimental-driver:testClasses
> Task :geode-experimental-driver:checkMissedTests
> Task :geode-experimental-driver:spotlessJava UP-TO-DATE
> Task :geode-experimental-driver:spotlessJavaCheck UP-TO-DATE
> Task :geode-experimental-driver:spotlessCheck UP-TO-DATE
> Task :geode-experimental-driver:test
> Task :geode-json:assemble
> Task :geode-json:compileTestJava NO-SOURCE
> Task :geode-json:processTestResources
> Task :geode-json:testClasses
> Task :geode-json:checkMissedTests NO-SOURCE
> Task :geode-json:spotlessJava UP-TO-DATE
> Task :geode-json:spotlessJavaCheck UP-TO-DATE
> Task :geode-json:spotlessCheck UP-TO-DATE
> Task :geode-json:test NO-SOURCE
> Task :geode-old-versions:javadoc NO-SOURCE
> Task :geode-junit:javadoc
> Task :geode-junit:javadocJar
> Task :geode-junit:sourcesJar
> Task :geode-junit:signArchives SKIPPED
> Task :geode-junit:assemble
> Task :geode-junit:compileTestJava FROM-CACHE
> Task :geode-junit:processTestResources
> Task :geode-junit:testClasses
> Task :geode-junit:checkMissedTests
> Task :geode-junit:spotlessJava UP-TO-DATE
> Task :geode-junit:spotlessJavaCheck UP-TO-DATE
> Task :geode-junit:spotlessCheck UP-TO-DATE
> Task :geode-junit:test
> Task :geode-lucene:assemble

> Task :geode-lucene:compileTestJava
Note: Some input files use or override a deprecated API.
Note: Recompile with -Xlint:deprecation for details.
Note: Some input files use unchecked or unsafe operations.
Note: Recompile with -Xlint:unchecked for details.

> Task :geode-lucene:processTestResources
> Task :geode-lucene:testClasses
> Task :geode-lucene:checkMissedTests
> Task :geode-lucene:spotlessJava UP-TO-DATE
> Task :geode-lucene:spotlessJavaCheck UP-TO-DATE
> Task :geode-lucene:spotlessCheck UP-TO-DATE
> Task :geode-lucene:test
> Task :geode-old-client-support:assemble
> Task :geode-old-client-support:compileTestJava
> Task :geode-old-client-support:processTestResources NO-SOURCE
> Task :geode-old-client-support:testClasses
> Task :geode-old-client-support:checkMissedTests
> Task :geode-old-client-support:spotlessJava UP-TO-DATE
> Task :geode-old-client-support:spotlessJavaCheck UP-TO-DATE
> Task :geode-old-client-support:spotlessCheck UP-TO-DATE
> Task :geode-old-client-support:test
> Task :geode-old-versions:javadocJar
> Task :geode-old-versions:sourcesJar
> Task :geode-old-versions:signArchives SKIPPED
> Task :geode-old-versions:assemble
> Task :geode-old-versions:compileTestJava NO-SOURCE
> Task :geode-old-versions:processTestResources NO-SOURCE
> Task :geode-old-versions:testClasses UP-TO-DATE
> Task :geode-old-versions:checkMissedTests NO-SOURCE
> Task :geode-old-versions:spotlessJava UP-TO-DATE
> Task :geode-old-versions:spotlessJavaCheck UP-TO-DATE
> Task :geode-old-versions:spotlessCheck UP-TO-DATE
> Task :geode-old-versions:test NO-SOURCE
> Task :geode-protobuf:assemble

> Task :geode-protobuf:compileTestJava
Note: Some input files use or override a deprecated API.
Note: Recompile with -Xlint:deprecation for details.
Note: Some input files use unchecked or unsafe operations.
Note: Recompile with -Xlint:unchecked for details.

> Task :geode-protobuf:processTestResources
> Task :geode-protobuf:testClasses
> Task :geode-protobuf:checkMissedTests
> Task :geode-protobuf:spotlessJava UP-TO-DATE
> Task :geode-protobuf:spotlessJavaCheck UP-TO-DATE
> Task :geode-protobuf:spotlessCheck UP-TO-DATE
> Task :geode-protobuf:test
> Task :geode-protobuf-messages:assemble
> Task :geode-protobuf-messages:extractIncludeTestProto
> Task :geode-protobuf-messages:extractTestProto
> Task :geode-protobuf-messages:generateTestProto NO-SOURCE
> Task :geode-protobuf-messages:compileTestJava NO-SOURCE
> Task :geode-protobuf-messages:processTestResources NO-SOURCE
> Task :geode-protobuf-messages:testClasses UP-TO-DATE
> Task :geode-protobuf-messages:checkMissedTests NO-SOURCE
> Task :geode-protobuf-messages:spotlessJava UP-TO-DATE
> Task :geode-protobuf-messages:spotlessJavaCheck UP-TO-DATE
> Task :geode-protobuf-messages:spotlessCheck UP-TO-DATE
> Task :geode-protobuf-messages:test NO-SOURCE
> Task :geode-pulse:assemble
> Task :geode-pulse:checkMissedTests
> Task :geode-pulse:spotlessJava UP-TO-DATE
> Task :geode-pulse:spotlessJavaCheck UP-TO-DATE
> Task :geode-pulse:spotlessCheck UP-TO-DATE
> Task :geode-pulse:test
> Task :geode-rebalancer:assemble
> Task :geode-rebalancer:compileTestJava FROM-CACHE
> Task :geode-rebalancer:processTestResources NO-SOURCE
> Task :geode-rebalancer:testClasses UP-TO-DATE
> Task :geode-rebalancer:checkMissedTests
> Task :geode-rebalancer:spotlessJava UP-TO-DATE
> Task :geode-rebalancer:spotlessJavaCheck UP-TO-DATE
> Task :geode-rebalancer:spotlessCheck UP-TO-DATE
> Task :geode-rebalancer:test
> Task :geode-wan:assemble

> Task :geode-wan:compileTestJava
Note: Some input files use or override a deprecated API.
Note: Recompile with -Xlint:deprecation for details.
Note: Some input files use unchecked or unsafe operations.
Note: Recompile with -Xlint:unchecked for details.

> Task :geode-wan:processTestResources
> Task :geode-wan:testClasses
> Task :geode-wan:checkMissedTests
> Task :geode-wan:spotlessJava UP-TO-DATE
> Task :geode-wan:spotlessJavaCheck UP-TO-DATE
> Task :geode-wan:spotlessCheck UP-TO-DATE
> Task :geode-wan:test
> Task :geode-web:assemble

> Task :geode-web:compileTestJava
Note: Some input files use or override a deprecated API.
Note: Recompile with -Xlint:deprecation for details.

> Task :geode-web:processTestResources NO-SOURCE
> Task :geode-web:testClasses
> Task :geode-web:checkMissedTests
> Task :geode-web:spotlessJava UP-TO-DATE
> Task :geode-web:spotlessJavaCheck UP-TO-DATE
> Task :geode-web:spotlessCheck UP-TO-DATE
> Task :geode-web:test
> Task :geode-web-api:assemble
> Task :geode-web-api:compileTestJava
> Task :geode-web-api:processTestResources
> Task :geode-web-api:testClasses
> Task :geode-web-api:checkMissedTests
> Task :geode-web-api:spotlessJava UP-TO-DATE
> Task :geode-web-api:spotlessJavaCheck UP-TO-DATE
> Task :geode-web-api:spotlessCheck UP-TO-DATE
> Task :geode-web-api:test

> Task :combineReports
All test reports at <https://builds.apache.org/job/Geode-nightly/ws/build/reports/combined>

> Task :uploadArchives
> Task :extensions/geode-modules:uploadArchives SKIPPED
> Task :extensions/geode-modules-assembly:uploadArchives SKIPPED
> Task :extensions/geode-modules-session:uploadArchives SKIPPED
> Task :extensions/geode-modules-session-internal:uploadArchives SKIPPED
> Task :extensions/geode-modules-tomcat7:uploadArchives SKIPPED
> Task :extensions/geode-modules-tomcat8:uploadArchives SKIPPED
> Task :extensions/session-testing-war:uploadArchives SKIPPED
> Task :geode-assembly:uploadArchives
> Task :geode-common:uploadArchives
> Task :geode-concurrency-test:uploadArchives
> Task :geode-connectors:uploadArchives
> Task :geode-core:uploadArchives
> Task :geode-cq:uploadArchives
> Task :geode-experimental-driver:uploadArchives
> Task :geode-json:uploadArchives
> Task :geode-junit:uploadArchives
> Task :geode-lucene:uploadArchives
> Task :geode-old-client-support:uploadArchives
> Task :geode-old-versions:uploadArchives SKIPPED
> Task :geode-protobuf:uploadArchives
> Task :geode-protobuf-messages:uploadArchives
> Task :geode-pulse:uploadArchives
> Task :geode-rebalancer:uploadArchives
> Task :geode-wan:uploadArchives
> Task :geode-web:uploadArchives
> Task :geode-web-api:uploadArchives

FAILURE: Build failed with an exception.

* What went wrong:
Execution failed for task ':rat'.
> Found 1 files with unapproved/unknown licenses. See <https://builds.apache.org/job/Geode-nightly/1238/artifact/build/reports/rat/rat-report.txt>

* Try:
Run with --stacktrace option to get the stack trace. Run with --info or --debug option to
get more log output. Run with --scan to get full insights.

* Get more help at https://help.gradle.org

Deprecated Gradle features were used in this build, making it incompatible with Gradle 5.0.
See https://docs.gradle.org/4.8/userguide/command_line_interface.html#sec:command_line_warnings

BUILD FAILED in 15m 28s
313 actionable tasks: 269 executed, 19 from cache, 25 up-to-date
Build step 'Invoke Gradle script' changed build result to FAILURE
Build step 'Invoke Gradle script' marked build as failure
Archiving artifacts
[Fast Archiver] Compressed 370.24 MB of artifacts by 43.3% relative to #1229
Recording test results
Not sending mail to unregistered user nag@cs.wisc.edu
Not sending mail to unregistered user gesterzhou@users.noreply.github.com
Not sending mail to unregistered user github@alasdairhodge.co.uk
Not sending mail to unregistered user jdeppe@pivotal.io
Not sending mail to unregistered user mdodge@pivotal.io

Mime
View raw message