geode-dev mailing list archives

Site index · List index
Message view « Date » · « Thread »
Top « Date » · « Thread »
From Apache Jenkins Server <jenk...@builds.apache.org>
Subject Build failed in Jenkins: Geode-nightly #1237
Date Wed, 27 Jun 2018 04:31:36 GMT
See <https://builds.apache.org/job/Geode-nightly/1237/display/redirect?page=changes>

Changes:

[bschuchardt] GEODE-1655: CI Failure in

------------------------------------------
[...truncated 26.66 KB...]
> Task :geode-assembly:assemble
> Task :extensions/session-testing-war:jar
> Task :geode-pulse:jar
> Task :geode-pulse:compileTestJava FROM-CACHE
> Task :geode-pulse:processTestResources
> Task :geode-pulse:testClasses
> Task :geode-assembly:compileTestJava FROM-CACHE
> Task :geode-assembly:processTestResources
> Task :geode-assembly:testClasses
> Task :geode-assembly:checkMissedTests
> Task :geode-assembly:spotlessJava
> Task :geode-assembly:spotlessJavaCheck
> Task :geode-assembly:spotlessCheck
> Task :geode-assembly:installDist
> Task :geode-assembly:test
> Task :geode-common:assemble
> Task :geode-common:compileTestJava FROM-CACHE
> Task :geode-common:processTestResources NO-SOURCE
> Task :geode-common:testClasses UP-TO-DATE
> Task :geode-common:checkMissedTests
> Task :geode-common:spotlessJava
> Task :geode-common:spotlessJavaCheck
> Task :geode-common:spotlessCheck
> Task :geode-common:test
> Task :geode-concurrency-test:javadoc FROM-CACHE
> Task :geode-concurrency-test:javadocJar
> Task :geode-concurrency-test:sourcesJar
> Task :geode-concurrency-test:signArchives SKIPPED
> Task :geode-concurrency-test:assemble
> Task :geode-concurrency-test:compileTestJava NO-SOURCE
> Task :geode-concurrency-test:processTestResources NO-SOURCE
> Task :geode-concurrency-test:testClasses UP-TO-DATE
> Task :geode-concurrency-test:checkMissedTests NO-SOURCE
> Task :geode-concurrency-test:spotlessJava
> Task :geode-concurrency-test:spotlessJavaCheck
> Task :geode-concurrency-test:spotlessCheck
> Task :geode-concurrency-test:test NO-SOURCE
> Task :geode-connectors:assemble
> Task :geode-connectors:compileTestJava FROM-CACHE
> Task :geode-connectors:processTestResources
> Task :geode-connectors:testClasses
> Task :geode-connectors:checkMissedTests
> Task :geode-connectors:spotlessJava
> Task :geode-connectors:spotlessJavaCheck
> Task :geode-connectors:spotlessCheck
> Task :geode-connectors:test
> Task :geode-core:assemble
> Task :geode-core:checkMissedTests
> Task :geode-core:spotlessJava
> Task :geode-core:spotlessJavaCheck
> Task :geode-core:spotlessCheck
> Task :geode-core:test
> Task :geode-cq:assemble
> Task :geode-cq:compileTestJava FROM-CACHE
> Task :geode-cq:processTestResources
> Task :geode-cq:testClasses
> Task :geode-cq:checkMissedTests
> Task :geode-cq:spotlessJava
> Task :geode-cq:spotlessJavaCheck
> Task :geode-cq:spotlessCheck
> Task :geode-cq:test
> Task :geode-experimental-driver:jar
> Task :geode-experimental-driver:javadoc FROM-CACHE
> Task :geode-experimental-driver:javadocJar
> Task :geode-experimental-driver:sourcesJar
> Task :geode-experimental-driver:signArchives SKIPPED
> Task :geode-experimental-driver:assemble
> Task :geode-experimental-driver:compileTestJava FROM-CACHE
> Task :geode-experimental-driver:processTestResources
> Task :geode-experimental-driver:testClasses
> Task :geode-experimental-driver:checkMissedTests
> Task :geode-experimental-driver:spotlessJava
> Task :geode-experimental-driver:spotlessJavaCheck
> Task :geode-experimental-driver:spotlessCheck
> Task :geode-experimental-driver:test
> Task :geode-json:assemble
> Task :geode-json:compileTestJava NO-SOURCE
> Task :geode-json:processTestResources
> Task :geode-json:testClasses
> Task :geode-json:checkMissedTests NO-SOURCE
> Task :geode-json:spotlessJava
> Task :geode-json:spotlessJavaCheck
> Task :geode-json:spotlessCheck
> Task :geode-json:test NO-SOURCE
> Task :geode-old-versions:javadoc NO-SOURCE
> Task :geode-junit:javadoc
> Task :geode-junit:javadocJar
> Task :geode-junit:sourcesJar
> Task :geode-junit:signArchives SKIPPED
> Task :geode-junit:assemble
> Task :geode-junit:compileTestJava FROM-CACHE
> Task :geode-junit:processTestResources
> Task :geode-junit:testClasses
> Task :geode-junit:checkMissedTests
> Task :geode-junit:spotlessJava
> Task :geode-junit:spotlessJavaCheck
> Task :geode-junit:spotlessCheck
> Task :geode-junit:test
> Task :geode-lucene:assemble
> Task :geode-lucene:compileTestJava FROM-CACHE
> Task :geode-lucene:processTestResources
> Task :geode-lucene:testClasses
> Task :geode-lucene:checkMissedTests
> Task :geode-lucene:spotlessJava
> Task :geode-lucene:spotlessJavaCheck
> Task :geode-lucene:spotlessCheck
> Task :geode-lucene:test
> Task :geode-old-client-support:assemble
> Task :geode-old-client-support:compileTestJava FROM-CACHE
> Task :geode-old-client-support:processTestResources NO-SOURCE
> Task :geode-old-client-support:testClasses UP-TO-DATE
> Task :geode-old-client-support:checkMissedTests
> Task :geode-old-client-support:spotlessJava
> Task :geode-old-client-support:spotlessJavaCheck
> Task :geode-old-client-support:spotlessCheck
> Task :geode-old-client-support:test
> Task :geode-old-versions:javadocJar
> Task :geode-old-versions:sourcesJar
> Task :geode-old-versions:signArchives SKIPPED
> Task :geode-old-versions:assemble
> Task :geode-old-versions:compileTestJava NO-SOURCE
> Task :geode-old-versions:processTestResources NO-SOURCE
> Task :geode-old-versions:testClasses UP-TO-DATE
> Task :geode-old-versions:checkMissedTests NO-SOURCE
> Task :geode-old-versions:spotlessJava
> Task :geode-old-versions:spotlessJavaCheck
> Task :geode-old-versions:spotlessCheck
> Task :geode-old-versions:test NO-SOURCE
> Task :geode-protobuf:assemble
> Task :geode-protobuf:compileTestJava FROM-CACHE
> Task :geode-protobuf:processTestResources
> Task :geode-protobuf:testClasses
> Task :geode-protobuf:checkMissedTests
> Task :geode-protobuf:spotlessJava
> Task :geode-protobuf:spotlessJavaCheck
> Task :geode-protobuf:spotlessCheck
> Task :geode-protobuf:test
> Task :geode-protobuf-messages:assemble
> Task :geode-protobuf-messages:extractIncludeTestProto
> Task :geode-protobuf-messages:extractTestProto
> Task :geode-protobuf-messages:generateTestProto NO-SOURCE
> Task :geode-protobuf-messages:compileTestJava NO-SOURCE
> Task :geode-protobuf-messages:processTestResources NO-SOURCE
> Task :geode-protobuf-messages:testClasses UP-TO-DATE
> Task :geode-protobuf-messages:checkMissedTests NO-SOURCE
> Task :geode-protobuf-messages:spotlessJava
> Task :geode-protobuf-messages:spotlessJavaCheck
> Task :geode-protobuf-messages:spotlessCheck
> Task :geode-protobuf-messages:test NO-SOURCE
> Task :geode-pulse:assemble
> Task :geode-pulse:checkMissedTests
> Task :geode-pulse:spotlessJava
> Task :geode-pulse:spotlessJavaCheck
> Task :geode-pulse:spotlessCheck
> Task :geode-pulse:test
> Task :geode-rebalancer:assemble
> Task :geode-rebalancer:compileTestJava FROM-CACHE
> Task :geode-rebalancer:processTestResources NO-SOURCE
> Task :geode-rebalancer:testClasses UP-TO-DATE
> Task :geode-rebalancer:checkMissedTests
> Task :geode-rebalancer:spotlessJava
> Task :geode-rebalancer:spotlessJavaCheck
> Task :geode-rebalancer:spotlessCheck
> Task :geode-rebalancer:test
> Task :geode-wan:assemble
> Task :geode-wan:compileTestJava FROM-CACHE
> Task :geode-wan:processTestResources
> Task :geode-wan:testClasses
> Task :geode-wan:checkMissedTests
> Task :geode-wan:spotlessJava
> Task :geode-wan:spotlessJavaCheck
> Task :geode-wan:spotlessCheck
> Task :geode-wan:test
> Task :geode-web:assemble
> Task :geode-web:compileTestJava FROM-CACHE
> Task :geode-web:processTestResources NO-SOURCE
> Task :geode-web:testClasses UP-TO-DATE
> Task :geode-web:checkMissedTests
> Task :geode-web:spotlessJava
> Task :geode-web:spotlessJavaCheck
> Task :geode-web:spotlessCheck
> Task :geode-web:test
> Task :geode-web-api:assemble
> Task :geode-web-api:compileTestJava FROM-CACHE
> Task :geode-web-api:processTestResources
> Task :geode-web-api:testClasses
> Task :geode-web-api:checkMissedTests
> Task :geode-web-api:spotlessJava
> Task :geode-web-api:spotlessJavaCheck
> Task :geode-web-api:spotlessCheck
> Task :geode-web-api:test

> Task :combineReports
All test reports at <https://builds.apache.org/job/Geode-nightly/ws/build/reports/combined>

> Task :uploadArchives
> Task :extensions/geode-modules:uploadArchives SKIPPED
> Task :extensions/geode-modules-assembly:uploadArchives SKIPPED
> Task :extensions/geode-modules-session:uploadArchives SKIPPED
> Task :extensions/geode-modules-session-internal:uploadArchives SKIPPED
> Task :extensions/geode-modules-tomcat7:uploadArchives SKIPPED
> Task :extensions/geode-modules-tomcat8:uploadArchives SKIPPED
> Task :extensions/session-testing-war:uploadArchives SKIPPED
> Task :geode-assembly:uploadArchives
> Task :geode-common:uploadArchives
> Task :geode-concurrency-test:uploadArchives
> Task :geode-connectors:uploadArchives
> Task :geode-core:uploadArchives
> Task :geode-cq:uploadArchives
> Task :geode-experimental-driver:uploadArchives
> Task :geode-json:uploadArchives
> Task :geode-junit:uploadArchives
> Task :geode-lucene:uploadArchives
> Task :geode-old-client-support:uploadArchives
> Task :geode-old-versions:uploadArchives SKIPPED
> Task :geode-protobuf:uploadArchives
> Task :geode-protobuf-messages:uploadArchives
> Task :geode-pulse:uploadArchives
> Task :geode-rebalancer:uploadArchives
> Task :geode-wan:uploadArchives
> Task :geode-web:uploadArchives
> Task :geode-web-api:uploadArchives

FAILURE: Build failed with an exception.

* What went wrong:
Execution failed for task ':rat'.
> Found 1 files with unapproved/unknown licenses. See <https://builds.apache.org/job/Geode-nightly/1237/artifact/build/reports/rat/rat-report.txt>

* Try:
Run with --stacktrace option to get the stack trace. Run with --info or --debug option to
get more log output. Run with --scan to get full insights.

* Get more help at https://help.gradle.org

Deprecated Gradle features were used in this build, making it incompatible with Gradle 5.0.
See https://docs.gradle.org/4.8/userguide/command_line_interface.html#sec:command_line_warnings

BUILD FAILED in 17m 5s
313 actionable tasks: 279 executed, 33 from cache, 1 up-to-date
Build step 'Invoke Gradle script' changed build result to FAILURE
Build step 'Invoke Gradle script' marked build as failure
Archiving artifacts
[Fast Archiver] Compressed 370.24 MB of artifacts by 43.2% relative to #1229
Recording test results
Not sending mail to unregistered user nag@cs.wisc.edu
Not sending mail to unregistered user gesterzhou@users.noreply.github.com
Not sending mail to unregistered user github@alasdairhodge.co.uk
Not sending mail to unregistered user jdeppe@pivotal.io
Not sending mail to unregistered user mdodge@pivotal.io

Mime
View raw message