geode-dev mailing list archives

Site index · List index
Message view « Date » · « Thread »
Top « Date » · « Thread »
From Apache Jenkins Server <jenk...@builds.apache.org>
Subject Build failed in Jenkins: Geode-nightly #1145
Date Tue, 27 Mar 2018 03:59:01 GMT
See <https://builds.apache.org/job/Geode-nightly/1145/display/redirect?page=changes>

Changes:

[github] GEODE-4827: null check for the cache. (#1646)

[bschuchardt] Revert "GEODE-4928 DistributedLockService doesn't work as expected while

[klund] GEODE-1279: Rename Bug51616JUnitTest as

[klund] GEODE-1279: Rename Bug33726JUnitTest as

[klund] GEODE-1279: Rename Bug34179TooManyFilesOpenJUnitTest as

[klund] GEODE-1279: Rename Bug34583JUnitTest as

[klund] GEODE-1279: Fix serialization of LocalVM

[klund] GEODE-1279: Rename Bug37241DUnitTest as

[klund] GEODE-1279: Rename Bug37377DUnitTest as

[klund] GEODE-1279: Rename Bug37500JUnitTest as

[klund] GEODE-1279: Rename Bug39079DUnitTest

[klund] GEODE-1279: Rename Bug40299DUnitTest as

[klund] GEODE-1279: Rename Bug40632DUnitTest as

[klund] GEODE-1279: Rename Bug41091DUnitTest as

[klund] GEODE-1279: Rename Bug41733DUnitTest as

[klund] GEODE-1279: Rename Bug41957DUnitTest as

[klund] GEODE-1279: Rename Bug42055DUnitTest as

[klund] GEODE-1279: Rename Bug45164DUnitTest as PREntrySetIteratorRegressionTest

[klund] GEODE-1279: Rename Bug45934DUnitTest as

[klund] GEODE-1279: Rename Bug47667DUnitTest as

[klund] GEODE-1279: Rename Bug36853EventsExpiryDUnitTest as

[bschuchardt] GEODE-4715 ReconnectDUnitTest calls static methods to obtain cache and

[bschuchardt] GEODE-4822 The second server instance startup error: Could not create an

[github] GEODE-4941: Increase UITests timeout to 2h (#1679)

[github] GEODE-4808: Add performance tests for rebalance simulation (#1667)

[github] GEODE-4933: Include members with NORMAL and PRELOADED data policy in …

------------------------------------------
[...truncated 116.73 KB...]
:geode-connectors:spotlessJavaCheck
:geode-connectors:spotlessCheck
:geode-connectors:test
:geode-connectors:check
:geode-connectors:build
:geode-core:assemble
:geode-core:checkMissedTests
:geode-core:spotlessJavaCheck
:geode-core:spotlessCheck
:geode-core:test

org.apache.geode.internal.HeapDataOutputStreamJUnitTest > testWriteJavaSerializeNoCopy
FAILED
    org.apache.geode.cache.CacheClosedException: Could not PDX serialize because the cache
was closed
        at org.apache.geode.pdx.internal.TypeRegistry.getPdxSerializer(TypeRegistry.java:366)
        at org.apache.geode.internal.InternalDataSerializer.writeUserObject(InternalDataSerializer.java:1661)
        at org.apache.geode.internal.InternalDataSerializer.writeWellKnownObject(InternalDataSerializer.java:1562)
        at org.apache.geode.internal.InternalDataSerializer.basicWriteObject(InternalDataSerializer.java:2226)
        at org.apache.geode.DataSerializer.writeObject(DataSerializer.java:2936)
        at org.apache.geode.internal.HeapDataOutputStreamJUnitTest.testWriteJavaSerializeNoCopy(HeapDataOutputStreamJUnitTest.java:148)

4150 tests completed, 1 failed, 9 skipped
:geode-core:test FAILED
:geode-cq:assemble
:geode-cq:compileTestJavaNote: Some input files use or override a deprecated API.
Note: Recompile with -Xlint:deprecation for details.
Note: Some input files use unchecked or unsafe operations.
Note: Recompile with -Xlint:unchecked for details.

:geode-cq:processTestResources
:geode-cq:testClasses
:geode-cq:checkMissedTests
:geode-cq:spotlessJavaCheck
:geode-cq:spotlessCheck
:geode-cq:test
:geode-cq:check
:geode-cq:build
:geode-experimental-driver:jar
:geode-experimental-driver:javadoc
:geode-experimental-driver:javadocJar
:geode-experimental-driver:sourcesJar
:geode-experimental-driver:signArchives SKIPPED
:geode-experimental-driver:assemble
:geode-experimental-driver:compileTestJavaNote: Some input files use unchecked or unsafe operations.
Note: Recompile with -Xlint:unchecked for details.

:geode-experimental-driver:processTestResources NO-SOURCE
:geode-experimental-driver:testClasses
:geode-experimental-driver:checkMissedTests
:geode-experimental-driver:spotlessJavaCheck
:geode-experimental-driver:spotlessCheck
:geode-experimental-driver:test
:geode-experimental-driver:check
:geode-experimental-driver:build
:geode-json:assemble
:geode-json:compileTestJava NO-SOURCE
:geode-json:processTestResources
:geode-json:testClasses
:geode-json:checkMissedTests NO-SOURCE
:geode-json:spotlessJavaCheck
:geode-json:spotlessCheck
:geode-json:test NO-SOURCE
:geode-json:check
:geode-json:build
:geode-junit:javadoc
:geode-junit:javadocJar
:geode-junit:sourcesJar
:geode-junit:signArchives SKIPPED
:geode-junit:assemble
:geode-junit:compileTestJavaNote: <https://builds.apache.org/job/Geode-nightly/ws/geode-junit/src/test/java/org/apache/geode/test/compiler/JarBuilderTest.java>
uses or overrides a deprecated API.
Note: Recompile with -Xlint:deprecation for details.
Note: <https://builds.apache.org/job/Geode-nightly/ws/geode-junit/src/test/java/org/apache/geode/test/compiler/ClassNameExtractorTest.java>
uses unchecked or unsafe operations.
Note: Recompile with -Xlint:unchecked for details.

:geode-junit:processTestResources
:geode-junit:testClasses
:geode-junit:checkMissedTests
:geode-junit:spotlessJavaCheck
:geode-junit:spotlessCheck
:geode-junit:test
:geode-junit:check
:geode-junit:build
:geode-lucene:assemble
:geode-lucene:compileTestJavaNote: Some input files use or override a deprecated API.
Note: Recompile with -Xlint:deprecation for details.
Note: Some input files use unchecked or unsafe operations.
Note: Recompile with -Xlint:unchecked for details.

:geode-lucene:processTestResources
:geode-lucene:testClasses
:geode-lucene:checkMissedTests
:geode-lucene:spotlessJavaCheck
:geode-lucene:spotlessCheck
:geode-lucene:test
:geode-lucene:check
:geode-lucene:build
:geode-old-client-support:assemble
:geode-old-client-support:compileTestJava
:geode-old-client-support:processTestResources NO-SOURCE
:geode-old-client-support:testClasses
:geode-old-client-support:checkMissedTests
:geode-old-client-support:spotlessJavaCheck
:geode-old-client-support:spotlessCheck
:geode-old-client-support:test
:geode-old-client-support:check
:geode-old-client-support:build
:geode-old-versions:javadoc NO-SOURCE
:geode-old-versions:javadocJar
:geode-old-versions:sourcesJar
:geode-old-versions:signArchives SKIPPED
:geode-old-versions:assemble
:geode-old-versions:compileTestJava NO-SOURCE
:geode-old-versions:processTestResources NO-SOURCE
:geode-old-versions:testClasses UP-TO-DATE
:geode-old-versions:checkMissedTests NO-SOURCE
:geode-old-versions:spotlessJavaCheck
:geode-old-versions:spotlessCheck
:geode-old-versions:test NO-SOURCE
:geode-old-versions:check
:geode-old-versions:build
:geode-protobuf:assemble
:geode-protobuf:compileTestJavaNote: Some input files use or override a deprecated API.
Note: Recompile with -Xlint:deprecation for details.
Note: Some input files use unchecked or unsafe operations.
Note: Recompile with -Xlint:unchecked for details.

:geode-protobuf:processTestResources
:geode-protobuf:testClasses
:geode-protobuf:checkMissedTests
:geode-protobuf:spotlessJavaCheck
:geode-protobuf:spotlessCheck
:geode-protobuf:test
:geode-protobuf:check
:geode-protobuf:build
:geode-protobuf-messages:assemble
:geode-protobuf-messages:extractIncludeTestProto
:geode-protobuf-messages:extractTestProto UP-TO-DATE
:geode-protobuf-messages:generateTestProto NO-SOURCE
:geode-protobuf-messages:compileTestJava NO-SOURCE
:geode-protobuf-messages:processTestResources NO-SOURCE
:geode-protobuf-messages:testClasses UP-TO-DATE
:geode-protobuf-messages:checkMissedTests NO-SOURCE
:geode-protobuf-messages:spotlessJavaCheck
:geode-protobuf-messages:spotlessCheck
:geode-protobuf-messages:test NO-SOURCE
:geode-protobuf-messages:check
:geode-protobuf-messages:build
:geode-pulse:assemble
:geode-pulse:checkMissedTests
:geode-pulse:spotlessJavaCheck
:geode-pulse:spotlessCheck
:geode-pulse:test
:geode-pulse:check
:geode-pulse:build
:geode-rebalancer:assemble
:geode-rebalancer:compileTestJavaNote: <https://builds.apache.org/job/Geode-nightly/ws/geode-rebalancer/src/test/java/org/apache/geode/cache/util/AutoBalancerJUnitTest.java>
uses or overrides a deprecated API.
Note: Recompile with -Xlint:deprecation for details.

:geode-rebalancer:processTestResources NO-SOURCE
:geode-rebalancer:testClasses
:geode-rebalancer:checkMissedTests
:geode-rebalancer:spotlessJavaCheck
:geode-rebalancer:spotlessCheck
:geode-rebalancer:test
:geode-rebalancer:check
:geode-rebalancer:build
:geode-wan:assemble
:geode-wan:compileTestJavaNote: Some input files use or override a deprecated API.
Note: Recompile with -Xlint:deprecation for details.
Note: Some input files use unchecked or unsafe operations.
Note: Recompile with -Xlint:unchecked for details.

:geode-wan:processTestResources
:geode-wan:testClasses
:geode-wan:checkMissedTests
:geode-wan:spotlessJavaCheck
:geode-wan:spotlessCheck
:geode-wan:test
:geode-wan:check
:geode-wan:build
:geode-web:assemble
:geode-web:compileTestJavaNote: Some input files use or override a deprecated API.
Note: Recompile with -Xlint:deprecation for details.

:geode-web:processTestResources NO-SOURCE
:geode-web:testClasses
:geode-web:checkMissedTests
:geode-web:spotlessJavaCheck
:geode-web:spotlessCheck
:geode-web:test
:geode-web:check
:geode-web:build
:geode-web-api:assemble
:geode-web-api:compileTestJava
:geode-web-api:processTestResources
:geode-web-api:testClasses
:geode-web-api:checkMissedTests
:geode-web-api:spotlessJavaCheck
:geode-web-api:spotlessCheck
:geode-web-api:test
:geode-web-api:check
:geode-web-api:build
:combineReports
All test reports at <https://builds.apache.org/job/Geode-nightly/ws/build/reports/combined>
:uploadArchives
:extensions/geode-modules:uploadArchives SKIPPED
:extensions/geode-modules-assembly:uploadArchives SKIPPED
:extensions/geode-modules-session:uploadArchives SKIPPED
:extensions/geode-modules-session-internal:uploadArchives SKIPPED
:extensions/geode-modules-tomcat7:uploadArchives SKIPPED
:extensions/geode-modules-tomcat8:uploadArchives SKIPPED
:extensions/session-testing-war:uploadArchives SKIPPED
:geode-assembly:uploadArchives
:geode-common:uploadArchives
:geode-concurrency-test:uploadArchives
:geode-connectors:uploadArchives
:geode-core:uploadArchives
:geode-cq:uploadArchives
:geode-experimental-driver:uploadArchives
:geode-json:uploadArchives
:geode-junit:uploadArchives
:geode-lucene:uploadArchives
:geode-old-client-support:uploadArchives
:geode-old-versions:uploadArchives SKIPPED
:geode-protobuf:uploadArchives
:geode-protobuf-messages:uploadArchives
:geode-pulse:uploadArchives
:geode-rebalancer:uploadArchives
:geode-wan:uploadArchives
:geode-web:uploadArchives
:geode-web-api:uploadArchives

FAILURE: Build failed with an exception.

* What went wrong:
Execution failed for task ':geode-core:test'.
> There were failing tests. See the report at: file://<https://builds.apache.org/job/Geode-nightly/ws/geode-core/build/reports/test/index.html>

* Try:
Run with --stacktrace option to get the stack trace. Run with --info or --debug option to
get more log output.

BUILD FAILED

Total time: 14 mins 33.126 secs
Build step 'Invoke Gradle script' changed build result to FAILURE
Build step 'Invoke Gradle script' marked build as failure
Archiving artifacts
[Fast Archiver] Compressed 368.74 MB of artifacts by 38.1% relative to #1144
Recording test results
Not sending mail to unregistered user github@alasdairhodge.co.uk

Mime
View raw message