geode-dev mailing list archives

Site index · List index
Message view « Date » · « Thread »
Top « Date » · « Thread »
From Apache Jenkins Server <jenk...@builds.apache.org>
Subject Build failed in Jenkins: Geode-nightly #1065
Date Fri, 05 Jan 2018 23:09:05 GMT
See <https://builds.apache.org/job/Geode-nightly/1065/display/redirect?page=changes>

Changes:

[bschuchardt] GEODE-4229 CI failure due to suspect string: "Locator socket was closed

[nabarunnag] GEODE-4135: Awaitility condition added

[metatype] Fix script so passing.txt is branch-dependent.

[github] GEODE-4131: add the deprecated API in MemberMXBean (#1231)

[github] GEODE-4160: fix gfsh describe jdbc-connection (#1223)

[huynhja] GEODE-4221: Restore the ability to access the debugging VM. (#1234)

[dsmith] GEODE-4158: Correct the detection of Geode-internal classes for

[klund] GEODE-3965: rename DistributionManager classes

[klund] GEODE-3965: define exceptionInThreads methods in DistributionManager

[klund] GEODE-3965: rename and cleanup DistributionManager tests

[bschuchardt] GEODE-4192 GetServer request should return error if no servers found

------------------------------------------
[...truncated 192.67 KB...]

:geode-cq:processTestResources
:geode-cq:testClasses
:geode-cq:checkMissedTests
:geode-cq:spotlessJavaCheck
:geode-cq:spotlessCheck
:geode-cq:test
:geode-experimental-driver:jar
:geode-experimental-driver:javadoc
:geode-experimental-driver:javadocJar
:geode-experimental-driver:sourcesJar
:geode-experimental-driver:signArchives SKIPPED
:geode-experimental-driver:assemble
:geode-experimental-driver:compileTestJava
:geode-experimental-driver:processTestResources NO-SOURCE
:geode-experimental-driver:testClasses
:geode-experimental-driver:checkMissedTests
:geode-experimental-driver:spotlessJavaCheck
:geode-experimental-driver:spotlessCheck
:geode-experimental-driver:test
:geode-json:assemble
:geode-json:compileTestJava NO-SOURCE
:geode-json:processTestResources
:geode-json:testClasses
:geode-json:checkMissedTests NO-SOURCE
:geode-json:spotlessJavaCheck
:geode-json:spotlessCheck
:geode-json:test NO-SOURCE
:geode-junit:javadoc
:geode-junit:javadocJar
:geode-junit:sourcesJar
:geode-junit:signArchives SKIPPED
:geode-junit:assemble
:geode-junit:compileTestJavaNote: <https://builds.apache.org/job/Geode-nightly/ws/geode-junit/src/test/java/org/apache/geode/test/compiler/JarBuilderTest.java>
uses or overrides a deprecated API.
Note: Recompile with -Xlint:deprecation for details.
Note: <https://builds.apache.org/job/Geode-nightly/ws/geode-junit/src/test/java/org/apache/geode/test/compiler/ClassNameExtractorTest.java>
uses unchecked or unsafe operations.
Note: Recompile with -Xlint:unchecked for details.

:geode-junit:processTestResources
:geode-junit:testClasses
:geode-junit:checkMissedTests
:geode-junit:spotlessJavaCheck
:geode-junit:spotlessCheck
:geode-junit:test
:geode-lucene:assemble
:geode-lucene:compileTestJava
Download https://repo1.maven.org/maven2/org/apache/lucene/lucene-test-framework/6.4.1/lucene-test-framework-6.4.1.pom
Download https://repo1.maven.org/maven2/org/apache/lucene/lucene-codecs/6.4.1/lucene-codecs-6.4.1.pom
Download https://repo1.maven.org/maven2/com/carrotsearch/randomizedtesting/randomizedtesting-runner/2.4.0/randomizedtesting-runner-2.4.0.pom
Download https://repo1.maven.org/maven2/com/carrotsearch/randomizedtesting/randomizedtesting-parent/2.4.0/randomizedtesting-parent-2.4.0.pom
Download https://repo1.maven.org/maven2/org/apache/lucene/lucene-test-framework/6.4.1/lucene-test-framework-6.4.1.jar
Download https://repo1.maven.org/maven2/org/apache/lucene/lucene-codecs/6.4.1/lucene-codecs-6.4.1.jar
Download https://repo1.maven.org/maven2/com/carrotsearch/randomizedtesting/randomizedtesting-runner/2.4.0/randomizedtesting-runner-2.4.0.jar
Note: Some input files use or override a deprecated API.
Note: Recompile with -Xlint:deprecation for details.
Note: Some input files use unchecked or unsafe operations.
Note: Recompile with -Xlint:unchecked for details.
:geode-lucene:processTestResources
:geode-lucene:testClasses
:geode-lucene:checkMissedTests
:geode-lucene:spotlessJavaCheck
:geode-lucene:spotlessCheck
:geode-lucene:test
:geode-old-client-support:assemble
:geode-old-client-support:compileTestJavaNote: <https://builds.apache.org/job/Geode-nightly/ws/geode-old-client-support/src/test/java/com/gemstone/gemfire/cache/execute/FunctionExceptionTest.java>
uses or overrides a deprecated API.
Note: Recompile with -Xlint:deprecation for details.

:geode-old-client-support:processTestResources NO-SOURCE
:geode-old-client-support:testClasses
:geode-old-client-support:checkMissedTests
:geode-old-client-support:spotlessJavaCheck
:geode-old-client-support:spotlessCheck
:geode-old-client-support:test
:geode-old-versions:javadoc NO-SOURCE
:geode-old-versions:javadocJar
:geode-old-versions:sourcesJar
:geode-old-versions:signArchives SKIPPED
:geode-old-versions:assemble
:geode-old-versions:compileTestJava NO-SOURCE
:geode-old-versions:processTestResources NO-SOURCE
:geode-old-versions:testClasses UP-TO-DATE
:geode-old-versions:checkMissedTests NO-SOURCE
:geode-old-versions:spotlessJavaCheck
:geode-old-versions:spotlessCheck
:geode-old-versions:test NO-SOURCE
:geode-protobuf:assemble
:geode-protobuf:compileTestJava
Download https://repo1.maven.org/maven2/org/powermock/powermock-api-mockito/1.7.1/powermock-api-mockito-1.7.1.pom
Download https://repo1.maven.org/maven2/org/powermock/powermock-api-mockito/1.7.1/powermock-api-mockito-1.7.1.jar
Note: Some input files use or override a deprecated API.
Note: Recompile with -Xlint:deprecation for details.
Note: Some input files use unchecked or unsafe operations.
Note: Recompile with -Xlint:unchecked for details.
:geode-protobuf:processTestResources
:geode-protobuf:testClasses
:geode-protobuf:checkMissedTests
:geode-protobuf:spotlessJavaCheck
:geode-protobuf:spotlessCheck
:geode-protobuf:test
:geode-protobuf-messages:assemble
:geode-protobuf-messages:extractIncludeTestProto
:geode-protobuf-messages:extractTestProto
:geode-protobuf-messages:generateTestProto NO-SOURCE
:geode-protobuf-messages:compileTestJava NO-SOURCE
:geode-protobuf-messages:processTestResources NO-SOURCE
:geode-protobuf-messages:testClasses UP-TO-DATE
:geode-protobuf-messages:checkMissedTests NO-SOURCE
:geode-protobuf-messages:spotlessJavaCheck
:geode-protobuf-messages:spotlessCheck
:geode-protobuf-messages:test NO-SOURCE
:geode-pulse:assemble
:geode-pulse:compileTestJava
Download https://repo1.maven.org/maven2/com/codeborne/phantomjsdriver/1.3.0/phantomjsdriver-1.3.0.pom
Download https://repo1.maven.org/maven2/org/seleniumhq/selenium/selenium-api/3.0.1/selenium-api-3.0.1.pom
Download https://repo1.maven.org/maven2/org/seleniumhq/selenium/selenium-remote-driver/3.0.1/selenium-remote-driver-3.0.1.pom
Download https://repo1.maven.org/maven2/org/seleniumhq/selenium/selenium-support/3.0.1/selenium-support-3.0.1.pom
Download https://repo1.maven.org/maven2/com/codeborne/phantomjsdriver/1.3.0/phantomjsdriver-1.3.0.jar
Download https://repo1.maven.org/maven2/org/seleniumhq/selenium/selenium-api/3.0.1/selenium-api-3.0.1.jar
Download https://repo1.maven.org/maven2/org/seleniumhq/selenium/selenium-remote-driver/3.0.1/selenium-remote-driver-3.0.1.jar
Download https://repo1.maven.org/maven2/org/seleniumhq/selenium/selenium-support/3.0.1/selenium-support-3.0.1.jar
Note: Some input files use or override a deprecated API.
Note: Recompile with -Xlint:deprecation for details.
Note: <https://builds.apache.org/job/Geode-nightly/ws/geode-pulse/src/test/java/org/apache/geode/tools/pulse/controllers/PulseControllerJUnitTest.java>
uses unchecked or unsafe operations.
Note: Recompile with -Xlint:unchecked for details.
:geode-pulse:processTestResources
:geode-pulse:testClasses
:geode-pulse:checkMissedTests
:geode-pulse:spotlessJavaCheck
:geode-pulse:spotlessCheck
:geode-pulse:test
:geode-rebalancer:assemble
:geode-rebalancer:compileTestJava
:geode-rebalancer:processTestResources NO-SOURCE
:geode-rebalancer:testClasses
:geode-rebalancer:checkMissedTests
:geode-rebalancer:spotlessJavaCheck
:geode-rebalancer:spotlessCheck
:geode-rebalancer:test
:geode-wan:assemble
:geode-wan:compileTestJavaNote: Some input files use or override a deprecated API.
Note: Recompile with -Xlint:deprecation for details.
Note: Some input files use unchecked or unsafe operations.
Note: Recompile with -Xlint:unchecked for details.

:geode-wan:processTestResources
:geode-wan:testClasses
:geode-wan:checkMissedTests
:geode-wan:spotlessJavaCheck
:geode-wan:spotlessCheck
:geode-wan:test
:geode-web:assemble
:geode-web:compileTestJavaNote: Some input files use or override a deprecated API.
Note: Recompile with -Xlint:deprecation for details.

:geode-web:processTestResources NO-SOURCE
:geode-web:testClasses
:geode-web:checkMissedTests
:geode-web:spotlessJavaCheck
:geode-web:spotlessCheck
:geode-web:test
:geode-web-api:assemble
:geode-web-api:compileTestJava
:geode-web-api:processTestResources
:geode-web-api:testClasses
:geode-web-api:checkMissedTests
:geode-web-api:spotlessJavaCheck
:geode-web-api:spotlessCheck
:geode-web-api:test
:combineReports
All test reports at <https://builds.apache.org/job/Geode-nightly/ws/build/reports/combined>
:uploadArchives
:extensions/geode-modules:uploadArchives SKIPPED
:extensions/geode-modules-assembly:uploadArchives SKIPPED
:extensions/geode-modules-session:uploadArchives SKIPPED
:extensions/geode-modules-session-internal:uploadArchives SKIPPED
:extensions/geode-modules-tomcat7:uploadArchives SKIPPED
:extensions/geode-modules-tomcat8:uploadArchives SKIPPED
:extensions/session-testing-war:uploadArchives SKIPPED
:geode-assembly:uploadArchivesCould not find metadata org.apache.geode:apache-geode:1.5.0-SNAPSHOT/maven-metadata.xml
in remote (https://repository.apache.org/content/repositories/snapshots)

:geode-benchmarks:uploadArchives SKIPPED
:geode-client-protocol:uploadArchivesCould not find metadata org.apache.geode:geode-client-protocol:1.5.0-SNAPSHOT/maven-metadata.xml
in remote (https://repository.apache.org/content/repositories/snapshots)

:geode-common:uploadArchivesCould not find metadata org.apache.geode:geode-common:1.5.0-SNAPSHOT/maven-metadata.xml
in remote (https://repository.apache.org/content/repositories/snapshots)

:geode-concurrency-test:uploadArchivesCould not find metadata org.apache.geode:geode-concurrency-test:1.5.0-SNAPSHOT/maven-metadata.xml
in remote (https://repository.apache.org/content/repositories/snapshots)

:geode-connectors:uploadArchivesCould not find metadata org.apache.geode:geode-connectors:1.5.0-SNAPSHOT/maven-metadata.xml
in remote (https://repository.apache.org/content/repositories/snapshots)

:geode-core:uploadArchivesCould not find metadata org.apache.geode:geode-core:1.5.0-SNAPSHOT/maven-metadata.xml
in remote (https://repository.apache.org/content/repositories/snapshots)

:geode-cq:uploadArchivesCould not find metadata org.apache.geode:geode-cq:1.5.0-SNAPSHOT/maven-metadata.xml
in remote (https://repository.apache.org/content/repositories/snapshots)

:geode-experimental-driver:uploadArchivesCould not find metadata org.apache.geode:geode-experimental-driver:1.5.0-SNAPSHOT/maven-metadata.xml
in remote (https://repository.apache.org/content/repositories/snapshots)

:geode-json:uploadArchivesCould not find metadata org.apache.geode:geode-json:1.5.0-SNAPSHOT/maven-metadata.xml
in remote (https://repository.apache.org/content/repositories/snapshots)

:geode-junit:uploadArchivesCould not find metadata org.apache.geode:geode-junit:1.5.0-SNAPSHOT/maven-metadata.xml
in remote (https://repository.apache.org/content/repositories/snapshots)

:geode-lucene:uploadArchivesCould not find metadata org.apache.geode:geode-lucene:1.5.0-SNAPSHOT/maven-metadata.xml
in remote (https://repository.apache.org/content/repositories/snapshots)

:geode-old-client-support:uploadArchivesCould not find metadata org.apache.geode:geode-old-client-support:1.5.0-SNAPSHOT/maven-metadata.xml
in remote (https://repository.apache.org/content/repositories/snapshots)

:geode-old-versions:uploadArchives SKIPPED
:geode-protobuf:uploadArchivesCould not find metadata org.apache.geode:geode-protobuf:1.5.0-SNAPSHOT/maven-metadata.xml
in remote (https://repository.apache.org/content/repositories/snapshots)

:geode-protobuf-messages:uploadArchivesCould not find metadata org.apache.geode:geode-protobuf-messages:1.5.0-SNAPSHOT/maven-metadata.xml
in remote (https://repository.apache.org/content/repositories/snapshots)

:geode-pulse:uploadArchivesCould not find metadata org.apache.geode:geode-pulse:1.5.0-SNAPSHOT/maven-metadata.xml
in remote (https://repository.apache.org/content/repositories/snapshots)

:geode-rebalancer:uploadArchivesCould not find metadata org.apache.geode:geode-rebalancer:1.5.0-SNAPSHOT/maven-metadata.xml
in remote (https://repository.apache.org/content/repositories/snapshots)

:geode-wan:uploadArchivesCould not find metadata org.apache.geode:geode-wan:1.5.0-SNAPSHOT/maven-metadata.xml
in remote (https://repository.apache.org/content/repositories/snapshots)

:geode-web:uploadArchivesCould not find metadata org.apache.geode:geode-web:1.5.0-SNAPSHOT/maven-metadata.xml
in remote (https://repository.apache.org/content/repositories/snapshots)

:geode-web-api:uploadArchivesCould not find metadata org.apache.geode:geode-web-api:1.5.0-SNAPSHOT/maven-metadata.xml
in remote (https://repository.apache.org/content/repositories/snapshots)


FAILURE: Build failed with an exception.

* What went wrong:
Execution failed for task ':rat'.
> Found 1 files with unapproved/unknown licenses. See <https://builds.apache.org/job/Geode-nightly/1065/artifact/build/reports/rat/rat-report.txt>

* Try:
Run with --stacktrace option to get the stack trace. Run with --info or --debug option to
get more log output.

BUILD FAILED

Total time: 20 mins 44.646 secs
Build step 'Invoke Gradle script' changed build result to FAILURE
Build step 'Invoke Gradle script' marked build as failure
Archiving artifacts
[Fast Archiver] Compressed 336.27 MB of artifacts by 26.7% relative to #1019
Recording test results
Not sending mail to unregistered user PurelyApplied@users.noreply.github.com
Not sending mail to unregistered user github@alasdairhodge.co.uk
Not sending mail to unregistered user huynhja@gmail.com
Not sending mail to unregistered user onichols@pivotal.io
Not sending mail to unregistered user dsmith@pivotal.io
Not sending mail to unregistered user lhughesgodfrey@pivotal.io
Not sending mail to unregistered user jdeppe@pivotal.io
Not sending mail to unregistered user metatype@users.noreply.github.com
Not sending mail to unregistered user jiliao@apache.org
Not sending mail to unregistered user nabarunnag@users.noreply.github.com
Not sending mail to unregistered user jean-pierre.huynh@alcatel-lucent.com
Not sending mail to unregistered user mdodge@pivotal.io
Not sending mail to unregistered user rhoughton@pivotal.io

Mime
View raw message