geode-dev mailing list archives

Site index · List index
Message view « Date » · « Thread »
Top « Date » · « Thread »
From Apache Jenkins Server <jenk...@builds.apache.org>
Subject Build failed in Jenkins: Geode-nightly #1061
Date Wed, 03 Jan 2018 03:50:00 GMT
See <https://builds.apache.org/job/Geode-nightly/1061/display/redirect>

------------------------------------------
[...truncated 209.30 KB...]
            at org.jgroups.JChannel.startStack(JChannel.java:889)
            at org.jgroups.JChannel._preConnect(JChannel.java:553)
            at org.jgroups.JChannel.connect(JChannel.java:288)
            at org.jgroups.JChannel.connect(JChannel.java:279)
            at org.apache.geode.distributed.internal.membership.gms.messenger.JGroupsMessenger.start(JGroupsMessenger.java:345)
            ... 13 more

    java.lang.AssertionError: Suspicious strings were written to the log during this run.
    Fix the strings or use IgnoredException.addIgnoredException to ignore.
    -----------------------------------------------------------------------
    Found suspect string in log4j at line 210

    [fatal 2018/01/02 11:47:11.427 UTC <Test worker> tid=0x13] Unexpected exception
while booting membership services
    org.apache.geode.SystemConnectException: unable to create jgroups channel
    	at org.apache.geode.distributed.internal.membership.gms.messenger.JGroupsMessenger.start(JGroupsMessenger.java:349)
    	at org.apache.geode.distributed.internal.membership.gms.Services.start(Services.java:157)
    	at org.apache.geode.distributed.internal.membership.gms.GMSMemberFactory.newMembershipManager(GMSMemberFactory.java:107)
    	at org.apache.geode.distributed.internal.membership.MemberFactory.newMembershipManager(MemberFactory.java:91)
    	at org.apache.geode.distributed.internal.DistributionManager.<init>(DistributionManager.java:1007)
    	at org.apache.geode.distributed.internal.DistributionManager.<init>(DistributionManager.java:1039)
    	at org.apache.geode.distributed.internal.DistributionManager.create(DistributionManager.java:553)
    	at org.apache.geode.distributed.internal.InternalDistributedSystem.initialize(InternalDistributedSystem.java:740)
    	at org.apache.geode.distributed.internal.InternalDistributedSystem.newInstance(InternalDistributedSystem.java:333)
    	at org.apache.geode.distributed.internal.InternalDistributedSystem.newInstance(InternalDistributedSystem.java:319)
    	at org.apache.geode.distributed.internal.InternalDistributedSystem.newInstance(InternalDistributedSystem.java:313)
    	at org.apache.geode.distributed.DistributedSystem.connect(DistributedSystem.java:205)
    	at org.apache.geode.test.dunit.internal.JUnit4DistributedTestCase.getSystem(JUnit4DistributedTestCase.java:205)
    	at org.apache.geode.distributed.DistributedSystemDUnitTest.testMembershipPortRangeWithExactThreeValues(DistributedSystemDUnitTest.java:270)
    	at sun.reflect.NativeMethodAccessorImpl.invoke0(Native Method)
    	at sun.reflect.NativeMethodAccessorImpl.invoke(NativeMethodAccessorImpl.java:62)
    	at sun.reflect.DelegatingMethodAccessorImpl.invoke(DelegatingMethodAccessorImpl.java:43)
    	at java.lang.reflect.Method.invoke(Method.java:498)
    	at org.junit.runners.model.FrameworkMethod$1.runReflectiveCall(FrameworkMethod.java:50)
    	at org.junit.internal.runners.model.ReflectiveCallable.run(ReflectiveCallable.java:12)
    	at org.junit.runners.model.FrameworkMethod.invokeExplosively(FrameworkMethod.java:47)
    	at org.junit.internal.runners.statements.InvokeMethod.evaluate(InvokeMethod.java:17)
    	at org.junit.internal.runners.statements.RunBefores.evaluate(RunBefores.java:26)
    	at org.junit.internal.runners.statements.RunAfters.evaluate(RunAfters.java:27)
    	at org.junit.rules.TestWatcher$1.evaluate(TestWatcher.java:55)
    	at org.junit.rules.RunRules.evaluate(RunRules.java:20)
    	at org.junit.runners.ParentRunner.runLeaf(ParentRunner.java:325)
    	at org.junit.runners.BlockJUnit4ClassRunner.runChild(BlockJUnit4ClassRunner.java:78)
    	at org.junit.runners.BlockJUnit4ClassRunner.runChild(BlockJUnit4ClassRunner.java:57)
    	at org.junit.runners.ParentRunner$3.run(ParentRunner.java:290)
    	at org.junit.runners.ParentRunner$1.schedule(ParentRunner.java:71)
    	at org.junit.runners.ParentRunner.runChildren(ParentRunner.java:288)
    	at org.junit.runners.ParentRunner.access$000(ParentRunner.java:58)
    	at org.junit.runners.ParentRunner$2.evaluate(ParentRunner.java:268)
    	at org.junit.internal.runners.statements.RunBefores.evaluate(RunBefores.java:26)
    	at org.junit.runners.ParentRunner.run(ParentRunner.java:363)
    	at org.gradle.api.internal.tasks.testing.junit.JUnitTestClassExecuter.runTestClass(JUnitTestClassExecuter.java:114)
    	at org.gradle.api.internal.tasks.testing.junit.JUnitTestClassExecuter.execute(JUnitTestClassExecuter.java:57)
    	at org.gradle.api.internal.tasks.testing.junit.JUnitTestClassProcessor.processTestClass(JUnitTestClassProcessor.java:66)
    	at org.gradle.api.internal.tasks.testing.SuiteTestClassProcessor.processTestClass(SuiteTestClassProcessor.java:51)
    	at sun.reflect.NativeMethodAccessorImpl.invoke0(Native Method)
    	at sun.reflect.NativeMethodAccessorImpl.invoke(NativeMethodAccessorImpl.java:62)
    	at sun.reflect.DelegatingMethodAccessorImpl.invoke(DelegatingMethodAccessorImpl.java:43)
    	at java.lang.reflect.Method.invoke(Method.java:498)
    	at org.gradle.internal.dispatch.ReflectionDispatch.dispatch(ReflectionDispatch.java:35)
    	at org.gradle.internal.dispatch.ReflectionDispatch.dispatch(ReflectionDispatch.java:24)
    	at org.gradle.internal.dispatch.ContextClassLoaderDispatch.dispatch(ContextClassLoaderDispatch.java:32)
    	at org.gradle.internal.dispatch.ProxyDispatchAdapter$DispatchingInvocationHandler.invoke(ProxyDispatchAdapter.java:93)
    	at com.sun.proxy.$Proxy2.processTestClass(Unknown Source)
    	at org.gradle.api.internal.tasks.testing.worker.TestWorker.processTestClass(TestWorker.java:109)
    	at sun.reflect.NativeMethodAccessorImpl.invoke0(Native Method)
    	at sun.reflect.NativeMethodAccessorImpl.invoke(NativeMethodAccessorImpl.java:62)
    	at sun.reflect.DelegatingMethodAccessorImpl.invoke(DelegatingMethodAccessorImpl.java:43)
    	at java.lang.reflect.Method.invoke(Method.java:498)
    	at org.gradle.internal.dispatch.ReflectionDispatch.dispatch(ReflectionDispatch.java:35)
    	at org.gradle.internal.dispatch.ReflectionDispatch.dispatch(ReflectionDispatch.java:24)
    	at org.gradle.internal.remote.internal.hub.MessageHubBackedObjectConnection$DispatchWrapper.dispatch(MessageHubBackedObjectConnection.java:147)
    	at org.gradle.internal.remote.internal.hub.MessageHubBackedObjectConnection$DispatchWrapper.dispatch(MessageHubBackedObjectConnection.java:129)
    	at org.gradle.internal.remote.internal.hub.MessageHub$Handler.run(MessageHub.java:404)
    	at org.gradle.internal.concurrent.ExecutorPolicy$CatchAndRecordFailures.onExecute(ExecutorPolicy.java:63)
    	at org.gradle.internal.concurrent.StoppableExecutorImpl$1.run(StoppableExecutorImpl.java:46)
    	at java.util.concurrent.ThreadPoolExecutor.runWorker(ThreadPoolExecutor.java:1149)
    	at java.util.concurrent.ThreadPoolExecutor$Worker.run(ThreadPoolExecutor.java:624)
    	at java.lang.Thread.run(Thread.java:748)
    Caused by: java.lang.Exception: failed to open a port in range 32769-32771
    	at org.jgroups.protocols.UDP.createMulticastSocketWithBindPort(UDP.java:503)
    	at org.jgroups.protocols.UDP.createSockets(UDP.java:348)
    	at org.jgroups.protocols.UDP.start(UDP.java:266)
    	at org.jgroups.stack.ProtocolStack.startStack(ProtocolStack.java:966)
    	at org.jgroups.JChannel.startStack(JChannel.java:889)
    	at org.jgroups.JChannel._preConnect(JChannel.java:553)
    	at org.jgroups.JChannel.connect(JChannel.java:288)
    	at org.jgroups.JChannel.connect(JChannel.java:279)
    	at org.apache.geode.distributed.internal.membership.gms.messenger.JGroupsMessenger.start(JGroupsMessenger.java:345)
    	... 63 more

org.apache.geode.distributed.DistributedSystemDUnitTest > testWaitForDeparture FAILED
    java.lang.IllegalStateException: A locator can not be created because one already exists
in this JVM.
        at org.apache.geode.distributed.internal.InternalLocator.createLocator(InternalLocator.java:266)
        at org.apache.geode.distributed.internal.InternalDistributedSystem.startInitLocator(InternalDistributedSystem.java:840)
        at org.apache.geode.distributed.internal.InternalDistributedSystem.initialize(InternalDistributedSystem.java:726)
        at org.apache.geode.distributed.internal.InternalDistributedSystem.newInstance(InternalDistributedSystem.java:333)
        at org.apache.geode.distributed.internal.InternalDistributedSystem.newInstance(InternalDistributedSystem.java:319)
        at org.apache.geode.distributed.internal.InternalDistributedSystem.newInstance(InternalDistributedSystem.java:313)
        at org.apache.geode.distributed.DistributedSystem.connect(DistributedSystem.java:205)
        at org.apache.geode.distributed.DistributedSystemDUnitTest.testWaitForDeparture(DistributedSystemDUnitTest.java:105)

org.apache.geode.distributed.DistributedSystemDUnitTest > testUDPPortRange FAILED
    org.apache.geode.SystemConnectException: unable to create jgroups channel
        at org.apache.geode.distributed.internal.membership.gms.messenger.JGroupsMessenger.start(JGroupsMessenger.java:349)
        at org.apache.geode.distributed.internal.membership.gms.Services.start(Services.java:157)
        at org.apache.geode.distributed.internal.membership.gms.GMSMemberFactory.newMembershipManager(GMSMemberFactory.java:107)
        at org.apache.geode.distributed.internal.membership.MemberFactory.newMembershipManager(MemberFactory.java:91)
        at org.apache.geode.distributed.internal.DistributionManager.<init>(DistributionManager.java:1007)
        at org.apache.geode.distributed.internal.DistributionManager.<init>(DistributionManager.java:1039)
        at org.apache.geode.distributed.internal.DistributionManager.create(DistributionManager.java:553)
        at org.apache.geode.distributed.internal.InternalDistributedSystem.initialize(InternalDistributedSystem.java:740)
        at org.apache.geode.distributed.internal.InternalDistributedSystem.newInstance(InternalDistributedSystem.java:333)
        at org.apache.geode.distributed.internal.InternalDistributedSystem.newInstance(InternalDistributedSystem.java:319)
        at org.apache.geode.distributed.internal.InternalDistributedSystem.newInstance(InternalDistributedSystem.java:313)
        at org.apache.geode.distributed.DistributedSystem.connect(DistributedSystem.java:205)
        at org.apache.geode.test.dunit.internal.JUnit4DistributedTestCase.getSystem(JUnit4DistributedTestCase.java:205)
        at org.apache.geode.distributed.DistributedSystemDUnitTest.testUDPPortRange(DistributedSystemDUnitTest.java:256)

        Caused by:
        java.lang.Exception: failed to open a port in range 32769-32771
            at org.jgroups.protocols.UDP.createMulticastSocketWithBindPort(UDP.java:503)
            at org.jgroups.protocols.UDP.createSockets(UDP.java:348)
            at org.jgroups.protocols.UDP.start(UDP.java:266)
            at org.jgroups.stack.ProtocolStack.startStack(ProtocolStack.java:966)
            at org.jgroups.JChannel.startStack(JChannel.java:889)
            at org.jgroups.JChannel._preConnect(JChannel.java:553)
            at org.jgroups.JChannel.connect(JChannel.java:288)
            at org.jgroups.JChannel.connect(JChannel.java:279)
            at org.apache.geode.distributed.internal.membership.gms.messenger.JGroupsMessenger.start(JGroupsMessenger.java:345)
            ... 13 more

    java.lang.AssertionError: Suspicious strings were written to the log during this run.
    Fix the strings or use IgnoredException.addIgnoredException to ignore.
    -----------------------------------------------------------------------
    Found suspect string in log4j at line 210

    [fatal 2018/01/02 11:47:19.855 UTC <Test worker> tid=0x13] Unexpected exception
while booting membership services
    org.apache.geode.SystemConnectException: unable to create jgroups channel
    	at org.apache.geode.distributed.internal.membership.gms.messenger.JGroupsMessenger.start(JGroupsMessenger.java:349)
    	at org.apache.geode.distributed.internal.membership.gms.Services.start(Services.java:157)
    	at org.apache.geode.distributed.internal.membership.gms.GMSMemberFactory.newMembershipManager(GMSMemberFactory.java:107)
    	at org.apache.geode.distributed.internal.membership.MemberFactory.newMembershipManager(MemberFactory.java:91)
    	at org.apache.geode.distributed.internal.DistributionManager.<init>(DistributionManager.java:1007)
    	at org.apache.geode.distributed.internal.DistributionManager.<init>(DistributionManager.java:1039)
    	at org.apache.geode.distributed.internal.DistributionManager.create(DistributionManager.java:553)
    	at org.apache.geode.distributed.internal.InternalDistributedSystem.initialize(InternalDistributedSystem.java:740)
    	at org.apache.geode.distributed.internal.InternalDistributedSystem.newInstance(InternalDistributedSystem.java:333)
    	at org.apache.geode.distributed.internal.InternalDistributedSystem.newInstance(InternalDistributedSystem.java:319)
    	at org.apache.geode.distributed.internal.InternalDistributedSystem.newInstance(InternalDistributedSystem.java:313)
    	at org.apache.geode.distributed.DistributedSystem.connect(DistributedSystem.java:205)
    	at org.apache.geode.test.dunit.internal.JUnit4DistributedTestCase.getSystem(JUnit4DistributedTestCase.java:205)
    	at org.apache.geode.distributed.DistributedSystemDUnitTest.testUDPPortRange(DistributedSystemDUnitTest.java:256)
    	at sun.reflect.NativeMethodAccessorImpl.invoke0(Native Method)
    	at sun.reflect.NativeMethodAccessorImpl.invoke(NativeMethodAccessorImpl.java:62)
    	at sun.reflect.DelegatingMethodAccessorImpl.invoke(DelegatingMethodAccessorImpl.java:43)
    	at java.lang.reflect.Method.invoke(Method.java:498)
    	at org.junit.runners.model.FrameworkMethod$1.runReflectiveCall(FrameworkMethod.java:50)
    	at org.junit.internal.runners.model.ReflectiveCallable.run(ReflectiveCallable.java:12)
    	at org.junit.runners.model.FrameworkMethod.invokeExplosively(FrameworkMethod.java:47)
    	at org.junit.internal.runners.statements.InvokeMethod.evaluate(InvokeMethod.java:17)
    	at org.junit.internal.runners.statements.RunBefores.evaluate(RunBefores.java:26)
    	at org.junit.internal.runners.statements.RunAfters.evaluate(RunAfters.java:27)
    	at org.junit.rules.TestWatcher$1.evaluate(TestWatcher.java:55)
    	at org.junit.rules.RunRules.evaluate(RunRules.java:20)
    	at org.junit.runners.ParentRunner.runLeaf(ParentRunner.java:325)
    	at org.junit.runners.BlockJUnit4ClassRunner.runChild(BlockJUnit4ClassRunner.java:78)
    	at org.junit.runners.BlockJUnit4ClassRunner.runChild(BlockJUnit4ClassRunner.java:57)
    	at org.junit.runners.ParentRunner$3.run(ParentRunner.java:290)
    	at org.junit.runners.ParentRunner$1.schedule(ParentRunner.java:71)
    	at org.junit.runners.ParentRunner.runChildren(ParentRunner.java:288)
    	at org.junit.runners.ParentRunner.access$000(ParentRunner.java:58)
    	at org.junit.runners.ParentRunner$2.evaluate(ParentRunner.java:268)
    	at org.junit.internal.runners.statements.RunBefores.evaluate(RunBefores.java:26)
    	at org.junit.runners.ParentRunner.run(ParentRunner.java:363)
    	at org.gradle.api.internal.tasks.testing.junit.JUnitTestClassExecuter.runTestClass(JUnitTestClassExecuter.java:114)
    	at org.gradle.api.internal.tasks.testing.junit.JUnitTestClassExecuter.execute(JUnitTestClassExecuter.java:57)
    	at org.gradle.api.internal.tasks.testing.junit.JUnitTestClassProcessor.processTestClass(JUnitTestClassProcessor.java:66)
    	at org.gradle.api.internal.tasks.testing.SuiteTestClassProcessor.processTestClass(SuiteTestClassProcessor.java:51)
    	at sun.reflect.NativeMethodAccessorImpl.invoke0(Native Method)
    	at sun.reflect.NativeMethodAccessorImpl.invoke(NativeMethodAccessorImpl.java:62)
    	at sun.reflect.DelegatingMethodAccessorImpl.invoke(DelegatingMethodAccessorImpl.java:43)
    	at java.lang.reflect.Method.invoke(Method.java:498)
    	at org.gradle.internal.dispatch.ReflectionDispatch.dispatch(ReflectionDispatch.java:35)
    	at org.gradle.internal.dispatch.ReflectionDispatch.dispatch(ReflectionDispatch.java:24)
    	at org.gradle.internal.dispatch.ContextClassLoaderDispatch.dispatch(ContextClassLoaderDispatch.java:32)
    	at org.gradle.internal.dispatch.ProxyDispatchAdapter$DispatchingInvocationHandler.invoke(ProxyDispatchAdapter.java:93)
    	at com.sun.proxy.$Proxy2.processTestClass(Unknown Source)
    	at org.gradle.api.internal.tasks.testing.worker.TestWorker.processTestClass(TestWorker.java:109)
    	at sun.reflect.NativeMethodAccessorImpl.invoke0(Native Method)
    	at sun.reflect.NativeMethodAccessorImpl.invoke(NativeMethodAccessorImpl.java:62)
    	at sun.reflect.DelegatingMethodAccessorImpl.invoke(DelegatingMethodAccessorImpl.java:43)
    	at java.lang.reflect.Method.invoke(Method.java:498)
    	at org.gradle.internal.dispatch.ReflectionDispatch.dispatch(ReflectionDispatch.java:35)
    	at org.gradle.internal.dispatch.ReflectionDispatch.dispatch(ReflectionDispatch.java:24)
    	at org.gradle.internal.remote.internal.hub.MessageHubBackedObjectConnection$DispatchWrapper.dispatch(MessageHubBackedObjectConnection.java:147)
    	at org.gradle.internal.remote.internal.hub.MessageHubBackedObjectConnection$DispatchWrapper.dispatch(MessageHubBackedObjectConnection.java:129)
    	at org.gradle.internal.remote.internal.hub.MessageHub$Handler.run(MessageHub.java:404)
    	at org.gradle.internal.concurrent.ExecutorPolicy$CatchAndRecordFailures.onExecute(ExecutorPolicy.java:63)
    	at org.gradle.internal.concurrent.StoppableExecutorImpl$1.run(StoppableExecutorImpl.java:46)
    	at java.util.concurrent.ThreadPoolExecutor.runWorker(ThreadPoolExecutor.java:1149)
    	at java.util.concurrent.ThreadPoolExecutor$Worker.run(ThreadPoolExecutor.java:624)
    	at java.lang.Thread.run(Thread.java:748)
    Caused by: java.lang.Exception: failed to open a port in range 32769-32771
    	at org.jgroups.protocols.UDP.createMulticastSocketWithBindPort(UDP.java:503)
    	at org.jgroups.protocols.UDP.createSockets(UDP.java:348)
    	at org.jgroups.protocols.UDP.start(UDP.java:266)
    	at org.jgroups.stack.ProtocolStack.startStack(ProtocolStack.java:966)
    	at org.jgroups.JChannel.startStack(JChannel.java:889)
    	at org.jgroups.JChannel._preConnect(JChannel.java:553)
    	at org.jgroups.JChannel.connect(JChannel.java:288)
    	at org.jgroups.JChannel.connect(JChannel.java:279)
    	at org.apache.geode.distributed.internal.membership.gms.messenger.JGroupsMessenger.start(JGroupsMessenger.java:345)
    	... 63 more

7698 tests completed, 4 failed, 504 skipped
:geode-core:distributedTest FAILED
:geode-core:integrationTest
:geode-cq:assemble
:geode-cq:compileTestJavaNote: Some input files use or override a deprecated API.
Note: Recompile with -Xlint:deprecation for details.
Note: Some input files use unchecked or unsafe operations.
Note: Recompile with -Xlint:unchecked for details.

:geode-cq:processTestResources
:geode-cq:testClasses
:geode-cq:checkMissedTests
:geode-cq:spotlessJavaCheck
:geode-cq:spotlessCheck
:geode-cq:test
:geode-cq:check
:geode-cq:build
Build timed out (after 1,440 minutes). Marking the build as failed.
:geode-cq:distributedTestBuild was aborted
Archiving artifacts
[Fast Archiver] Compressed 338.76 MB of artifacts by 26.6% relative to #1019
Recording test results
Not sending mail to unregistered user jdeppe@pivotal.io
Not sending mail to unregistered user jean-pierre.huynh@alcatel-lucent.com
Not sending mail to unregistered user dsmith@pivotal.io
Not sending mail to unregistered user PurelyApplied@users.noreply.github.com
Not sending mail to unregistered user lhughesgodfrey@pivotal.io
Not sending mail to unregistered user onichols@pivotal.io
Not sending mail to unregistered user github@alasdairhodge.co.uk
Not sending mail to unregistered user mdodge@pivotal.io
Not sending mail to unregistered user nabarunnag@users.noreply.github.com
Not sending mail to unregistered user metatype@apache.org
Not sending mail to unregistered user rhoughton@pivotal.io
Not sending mail to unregistered user huynhja@gmail.com
Not sending mail to unregistered user jiliao@apache.org

Mime
View raw message