geode-dev mailing list archives

Site index · List index
Message view « Date » · « Thread »
Top « Date » · « Thread »
From Apache Jenkins Server <jenk...@builds.apache.org>
Subject Build failed in Jenkins: Geode-nightly #1044
Date Fri, 15 Dec 2017 21:58:42 GMT
See <https://builds.apache.org/job/Geode-nightly/1044/display/redirect?page=changes>

Changes:

[dschneider] GEODE-4091: add ThreadFactory for evictor

[github] GEODE-4083: fix infinite loop caused by thread race changing version

[dschneider] GEODE-4099: change warning to debug

[github] GEODE-3799: Move backups towards a pluggable architecture (#1109)

------------------------------------------
[...truncated 771.76 KB...]
:geode-protobuf-messages:assemble
:geode-protobuf-messages:extractIncludeTestProto
:geode-protobuf-messages:extractTestProto UP-TO-DATE
:geode-protobuf-messages:generateTestProto NO-SOURCE
:geode-protobuf-messages:compileTestJava NO-SOURCE
:geode-protobuf-messages:processTestResources NO-SOURCE
:geode-protobuf-messages:testClasses UP-TO-DATE
:geode-protobuf-messages:checkMissedTests NO-SOURCE
:geode-protobuf-messages:spotlessJavaCheck
:geode-protobuf-messages:spotlessCheck
:geode-protobuf-messages:test NO-SOURCE
:geode-protobuf-messages:check
:geode-protobuf-messages:build
:geode-protobuf-messages:distributedTest NO-SOURCE
:geode-protobuf-messages:integrationTest NO-SOURCE
:geode-pulse:assemble
:geode-pulse:compileTestJavaNote: Some input files use or override a deprecated API.
Note: Recompile with -Xlint:deprecation for details.
Note: <https://builds.apache.org/job/Geode-nightly/ws/geode-pulse/src/test/java/org/apache/geode/tools/pulse/controllers/PulseControllerJUnitTest.java>
uses unchecked or unsafe operations.
Note: Recompile with -Xlint:unchecked for details.

:geode-pulse:processTestResources
:geode-pulse:testClasses
:geode-pulse:checkMissedTests
:geode-pulse:spotlessJavaCheck
:geode-pulse:spotlessCheck
:geode-pulse:test
:geode-pulse:check
:geode-pulse:build
:geode-pulse:distributedTest
:geode-pulse:integrationTest
:geode-rebalancer:assemble
:geode-rebalancer:compileTestJava
:geode-rebalancer:processTestResources NO-SOURCE
:geode-rebalancer:testClasses
:geode-rebalancer:checkMissedTests
:geode-rebalancer:spotlessJavaCheck
:geode-rebalancer:spotlessCheck
:geode-rebalancer:test
:geode-rebalancer:check
:geode-rebalancer:build
:geode-rebalancer:distributedTest
:geode-rebalancer:integrationTest
:geode-wan:assemble
:geode-wan:compileTestJavaNote: Some input files use or override a deprecated API.
Note: Recompile with -Xlint:deprecation for details.
Note: Some input files use unchecked or unsafe operations.
Note: Recompile with -Xlint:unchecked for details.

:geode-wan:processTestResources
:geode-wan:testClasses
:geode-wan:checkMissedTests
:geode-wan:spotlessJavaCheck
:geode-wan:spotlessCheck
:geode-wan:test
:geode-wan:check
:geode-wan:build
:geode-wan:distributedTest

org.apache.geode.internal.cache.wan.misc.NewWanAuthenticationDUnitTest > testWanAuthValidCredentials
FAILED
    org.apache.geode.test.dunit.RMIException: While invoking org.apache.geode.internal.cache.wan.misc.NewWanAuthenticationDUnitTest$$Lambda$446/70160879.run
in VM 2 running on Host asf913.gq1.ygridcore.net with 8 VMs
        at org.apache.geode.test.dunit.VM.invoke(VM.java:393)
        at org.apache.geode.test.dunit.VM.invoke(VM.java:363)
        at org.apache.geode.test.dunit.VM.invoke(VM.java:308)
        at org.apache.geode.internal.cache.wan.misc.NewWanAuthenticationDUnitTest.testWanAuthValidCredentials(NewWanAuthenticationDUnitTest.java:113)

        Caused by:
        org.apache.geode.internal.cache.wan.GatewaySenderException: Could not start a gateway
sender ln because of exception org.apache.geode.security.AuthenticationFailedException: DummyAuthenticator:
Invalid user name [invalid1], password supplied., caused by org.apache.geode.security.AuthenticationFailedException:
DummyAuthenticator: Invalid user name [invalid1], password supplied.
            at org.apache.geode.internal.cache.wan.AbstractGatewaySender.waitForRunningStatus(AbstractGatewaySender.java:752)
            at org.apache.geode.internal.cache.wan.serial.SerialGatewaySenderImpl.start(SerialGatewaySenderImpl.java:90)
            at org.apache.geode.internal.cache.wan.WANTestBase.startSender(WANTestBase.java:1119)
            at org.apache.geode.internal.cache.wan.misc.NewWanAuthenticationDUnitTest.lambda$testWanAuthValidCredentials$bb17a952$4(NewWanAuthenticationDUnitTest.java:113)

            Caused by:
            org.apache.geode.security.AuthenticationFailedException: DummyAuthenticator: Invalid
user name [invalid1], password supplied.

org.apache.geode.internal.cache.wan.misc.NewWanAuthenticationDUnitTest > testWanAuthValidCredentialsWithServer
FAILED
    org.apache.geode.test.dunit.RMIException: While invoking org.apache.geode.internal.cache.wan.misc.NewWanAuthenticationDUnitTest$$Lambda$471/410285177.run
in VM 2 running on Host asf913.gq1.ygridcore.net with 8 VMs
        at org.apache.geode.test.dunit.VM.invoke(VM.java:393)
        at org.apache.geode.test.dunit.VM.invoke(VM.java:363)
        at org.apache.geode.test.dunit.VM.invoke(VM.java:308)
        at org.apache.geode.internal.cache.wan.misc.NewWanAuthenticationDUnitTest.testWanAuthValidCredentialsWithServer(NewWanAuthenticationDUnitTest.java:411)

        Caused by:
        org.apache.geode.internal.cache.wan.GatewaySenderException: Could not start a gateway
sender ln because of exception org.apache.geode.security.AuthenticationFailedException: DummyAuthenticator:
Invalid user name [invalid2], password supplied., caused by org.apache.geode.security.AuthenticationFailedException:
DummyAuthenticator: Invalid user name [invalid2], password supplied.
            at org.apache.geode.internal.cache.wan.AbstractGatewaySender.waitForRunningStatus(AbstractGatewaySender.java:752)
            at org.apache.geode.internal.cache.wan.serial.SerialGatewaySenderImpl.start(SerialGatewaySenderImpl.java:90)
            at org.apache.geode.internal.cache.wan.WANTestBase.startSender(WANTestBase.java:1119)
            at org.apache.geode.internal.cache.wan.misc.NewWanAuthenticationDUnitTest.lambda$testWanAuthValidCredentialsWithServer$bb17a952$2(NewWanAuthenticationDUnitTest.java:411)

            Caused by:
            org.apache.geode.security.AuthenticationFailedException: DummyAuthenticator: Invalid
user name [invalid2], password supplied.

    java.lang.AssertionError: Suspicious strings were written to the log during this run.
    Fix the strings or use IgnoredException.addIgnoredException to ignore.
    -----------------------------------------------------------------------
    Found suspect string in log4j at line 1455

    [fatal 2017/12/15 20:54:18.979 UTC <Event Processor for GatewaySender_ln> tid=2660]
Message dispatch failed due to unexpected exception..
    org.apache.geode.internal.cache.wan.GatewaySenderException: org.apache.geode.security.AuthenticationFailedException:
DummyAuthenticator: Invalid user name [invalid2], password supplied., caused by org.apache.geode.security.AuthenticationFailedException:
DummyAuthenticator: Invalid user name [invalid2], password supplied.
    	at org.apache.geode.internal.cache.wan.GatewaySenderEventRemoteDispatcher.initializeConnection(GatewaySenderEventRemoteDispatcher.java:432)
    	at org.apache.geode.internal.cache.wan.GatewaySenderEventRemoteDispatcher.<init>(GatewaySenderEventRemoteDispatcher.java:75)
    	at org.apache.geode.internal.cache.wan.serial.RemoteSerialGatewaySenderEventProcessor.initializeEventDispatcher(RemoteSerialGatewaySenderEventProcessor.java:41)
    	at org.apache.geode.internal.cache.wan.AbstractGatewaySenderEventProcessor.setRunningStatus(AbstractGatewaySenderEventProcessor.java:1078)
    	at org.apache.geode.internal.cache.wan.serial.SerialGatewaySenderEventProcessor.run(SerialGatewaySenderEventProcessor.java:196)
    Caused by: org.apache.geode.security.AuthenticationFailedException: DummyAuthenticator:
Invalid user name [invalid2], password supplied.
    	at org.apache.geode.security.templates.DummyAuthenticator.authenticate(DummyAuthenticator.java:65)
    	at org.apache.geode.internal.cache.tier.sockets.HandShake.verifyCredentials(HandShake.java:1693)
    	at org.apache.geode.internal.cache.tier.sockets.HandShake.checkIfAuthenticWanSite(HandShake.java:1740)
    	at org.apache.geode.internal.cache.tier.sockets.HandShake.readMessage(HandShake.java:1403)
    	at org.apache.geode.internal.cache.tier.sockets.HandShake.handshakeWithServer(HandShake.java:1255)
    	at org.apache.geode.cache.client.internal.ConnectionImpl.connect(ConnectionImpl.java:120)
    	at org.apache.geode.cache.client.internal.ConnectionFactoryImpl.createClientToServerConnection(ConnectionFactoryImpl.java:137)
    	at org.apache.geode.cache.client.internal.ConnectionFactoryImpl.createClientToServerConnection(ConnectionFactoryImpl.java:260)
    	at org.apache.geode.cache.client.internal.pooling.ConnectionManagerImpl.borrowConnection(ConnectionManagerImpl.java:207)
    	at org.apache.geode.cache.client.internal.PoolImpl.acquireConnection(PoolImpl.java:902)
    	at org.apache.geode.internal.cache.wan.GatewaySenderEventRemoteDispatcher.initializeConnection(GatewaySenderEventRemoteDispatcher.java:405)
    	... 4 more

634 tests completed, 2 failed, 59 skipped
:geode-wan:distributedTest FAILED
:geode-wan:integrationTest
:geode-web:assemble
:geode-web:compileTestJavaNote: Some input files use or override a deprecated API.
Note: Recompile with -Xlint:deprecation for details.

:geode-web:processTestResources NO-SOURCE
:geode-web:testClasses
:geode-web:checkMissedTests
:geode-web:spotlessJavaCheck
:geode-web:spotlessCheck
:geode-web:test
:geode-web:check
:geode-web:build
:geode-web:distributedTest
:geode-web:integrationTest
:geode-web-api:assemble
:geode-web-api:compileTestJava
:geode-web-api:processTestResources
:geode-web-api:testClasses
:geode-web-api:checkMissedTests
:geode-web-api:spotlessJavaCheck
:geode-web-api:spotlessCheck
:geode-web-api:test
:geode-web-api:check
:geode-web-api:build
:geode-web-api:distributedTest
:geode-web-api:integrationTest
:combineReports
All test reports at <https://builds.apache.org/job/Geode-nightly/ws/build/reports/combined>
:compileJava NO-SOURCE
:processResources NO-SOURCE
:classes UP-TO-DATE
:jar
:uploadArchives
:extensions/geode-modules:uploadArchives SKIPPED
:extensions/geode-modules-assembly:uploadArchives SKIPPED
:extensions/geode-modules-session:uploadArchives SKIPPED
:extensions/geode-modules-session-internal:uploadArchives SKIPPED
:extensions/geode-modules-tomcat7:uploadArchives SKIPPED
:extensions/geode-modules-tomcat8:uploadArchives SKIPPED
:extensions/session-testing-war:uploadArchives SKIPPED
:geode-assembly:uploadArchives
:geode-benchmarks:uploadArchives SKIPPED
:geode-client-protocol:uploadArchives
:geode-common:uploadArchives
:geode-concurrency-test:uploadArchives
:geode-core:uploadArchives
:geode-cq:uploadArchives
:geode-json:uploadArchives
:geode-junit:uploadArchives
:geode-lucene:uploadArchives
:geode-old-client-support:uploadArchives
:geode-old-versions:uploadArchives SKIPPED
:geode-protobuf:uploadArchives
:geode-protobuf-messages:uploadArchives
:geode-pulse:uploadArchives
:geode-rebalancer:uploadArchives
:geode-wan:uploadArchives
:geode-web:uploadArchives
:geode-web-api:uploadArchives

FAILURE: Build completed with 5 failures.

1: Task failed with an exception.
-----------
* What went wrong:
Execution failed for task ':geode-assembly:acceptanceTest'.
> There were failing tests. See the report at: file://<https://builds.apache.org/job/Geode-nightly/ws/geode-assembly/build/reports/acceptanceTest/index.html>

* Try:
Run with --stacktrace option to get the stack trace. Run with --info or --debug option to
get more log output.
==============================================================================

2: Task failed with an exception.
-----------
* What went wrong:
Execution failed for task ':geode-assembly:distributedTest'.
> There were failing tests. See the report at: file://<https://builds.apache.org/job/Geode-nightly/ws/geode-assembly/build/reports/distributedTest/index.html>

* Try:
Run with --stacktrace option to get the stack trace. Run with --info or --debug option to
get more log output.
==============================================================================

3: Task failed with an exception.
-----------
* What went wrong:
Execution failed for task ':geode-core:distributedTest'.
> There were failing tests. See the report at: file://<https://builds.apache.org/job/Geode-nightly/ws/geode-core/build/reports/distributedTest/index.html>

* Try:
Run with --stacktrace option to get the stack trace. Run with --info or --debug option to
get more log output.
==============================================================================

4: Task failed with an exception.
-----------
* What went wrong:
Execution failed for task ':geode-cq:distributedTest'.
> There were failing tests. See the report at: file://<https://builds.apache.org/job/Geode-nightly/ws/geode-cq/build/reports/distributedTest/index.html>

* Try:
Run with --stacktrace option to get the stack trace. Run with --info or --debug option to
get more log output.
==============================================================================

5: Task failed with an exception.
-----------
* What went wrong:
Execution failed for task ':geode-wan:distributedTest'.
> There were failing tests. See the report at: file://<https://builds.apache.org/job/Geode-nightly/ws/geode-wan/build/reports/distributedTest/index.html>

* Try:
Run with --stacktrace option to get the stack trace. Run with --info or --debug option to
get more log output.
==============================================================================

BUILD FAILED

Total time: 18 hrs 13 mins 47.583 secs
Build step 'Invoke Gradle script' changed build result to FAILURE
Build step 'Invoke Gradle script' marked build as failure
Archiving artifacts
[Fast Archiver] Compressed 336.75 MB of artifacts by 37.2% relative to #1019
Recording test results
Not sending mail to unregistered user github@nakomis.com
Not sending mail to unregistered user dsmith@pivotal.io
Not sending mail to unregistered user jdeppe@gopivotal.com
Not sending mail to unregistered user metatype@users.noreply.github.com
Not sending mail to unregistered user jhuynh@Jason-Huynh-MacBook-Pro.local
Not sending mail to unregistered user jiliao@pivotal.io
Not sending mail to unregistered user nabarunnag@users.noreply.github.com

Mime
View raw message