geode-dev mailing list archives

Site index · List index
Message view « Date » · « Thread »
Top « Date » · « Thread »
From Apache Jenkins Server <jenk...@builds.apache.org>
Subject Build failed in Jenkins: Geode-nightly-flaky #187
Date Thu, 07 Dec 2017 05:17:18 GMT
See <https://builds.apache.org/job/Geode-nightly-flaky/187/display/redirect?page=changes>

Changes:

[nabarunnag] GEODE-4042: Cargo tests will use java.io.tmpdir if possible, instead

[github] GEODE-4035: Refactor Converter classes (#1110)

[github] GEODE-4029: Deployed jars may not be correct when multiple locators a…

[github] GEODE-4033: Exception is thrown when Tx Id is not found on server dur…

[jinmeiliao] GEODE-4049: add convenience methods for easy mocking and reduce code

[jinmeiliao] GEODE-4049: add convenience methods for easy mocking and reduce code

[jinmeiliao] GEODE-4049: refactor CreateRegionCommand and DestoryRegionCommand status

[nabarunnag] GEODE-4042: Fixed additional tmp dir references (#1121)

[bschuchardt] GEODE-3683 CacheConnectionTimeoutJUnitTest failing intermittently in CI

[bschuchardt] GEODE-3923 Provide whitelist/blacklist capability for java serialization

[dsmith] GEODE-4058: Always delete disk files after every test runs

[github] GEODE-4052: Extract GfshExitCodeStatusCommandsTest to multiple

[prhomberg] GEODE-3955: Preparing, refactoring, and addition of test utility

[prhomberg] GEODE-3955: Add AEQ and Gateway Sender information to 'describe region'

[dsmith] GEODE-4007: Authentication/Handshake errors should close the socket

[dsmith] GEODE-4053: Create module for Protobuf messages

------------------------------------------
[...truncated 110.67 KB...]
:geode-lucene:classes
:geode-old-client-support:compileJavaNote: Some input files use or override a deprecated API.
Note: Recompile with -Xlint:deprecation for details.

:geode-old-client-support:processResources
:geode-old-client-support:classes
:geode-protobuf-messages:extractIncludeProto
:geode-protobuf-messages:extractProto
:geode-protobuf-messages:generateProto
Download https://repo1.maven.org/maven2/com/google/protobuf/protoc/3.0.0/protoc-3.0.0.pom
Download https://repo1.maven.org/maven2/com/google/protobuf/protoc/3.0.0/protoc-3.0.0-linux-x86_64.exe
:geode-protobuf-messages:compileJava
:geode-protobuf-messages:processResources
:geode-protobuf-messages:classes
:geode-protobuf-messages:jar
:geode-protobuf:compileJavaNote: Some input files use unchecked or unsafe operations.
Note: Recompile with -Xlint:unchecked for details.

:geode-protobuf:processResources
:geode-protobuf:classes
:geode-pulse:compileJava
Download https://repo1.maven.org/maven2/org/springframework/security/spring-security-config/4.2.1.RELEASE/spring-security-config-4.2.1.RELEASE.pom
Download https://repo1.maven.org/maven2/org/springframework/security/spring-security-ldap/4.2.1.RELEASE/spring-security-ldap-4.2.1.RELEASE.pom
Download https://repo1.maven.org/maven2/org/springframework/security/spring-security-web/4.2.1.RELEASE/spring-security-web-4.2.1.RELEASE.pom
Download https://repo1.maven.org/maven2/org/springframework/spring-tx/4.3.6.RELEASE/spring-tx-4.3.6.RELEASE.pom
Download https://repo1.maven.org/maven2/org/springframework/security/spring-security-core/4.2.1.RELEASE/spring-security-core-4.2.1.RELEASE.pom
Download https://repo1.maven.org/maven2/org/springframework/security/spring-security-config/4.2.1.RELEASE/spring-security-config-4.2.1.RELEASE.jar
Download https://repo1.maven.org/maven2/org/springframework/security/spring-security-ldap/4.2.1.RELEASE/spring-security-ldap-4.2.1.RELEASE.jar
Download https://repo1.maven.org/maven2/org/springframework/security/spring-security-web/4.2.1.RELEASE/spring-security-web-4.2.1.RELEASE.jar
Download https://repo1.maven.org/maven2/org/springframework/spring-tx/4.3.6.RELEASE/spring-tx-4.3.6.RELEASE.jar
Download https://repo1.maven.org/maven2/org/springframework/security/spring-security-core/4.2.1.RELEASE/spring-security-core-4.2.1.RELEASE.jar
Note: Some input files use or override a deprecated API.
Note: Recompile with -Xlint:deprecation for details.
Note: Some input files use unchecked or unsafe operations.
Note: Recompile with -Xlint:unchecked for details.
:geode-pulse:copyGemFireVersionFile
:geode-pulse:processResources
:geode-pulse:classes
:geode-rebalancer:compileJavaNote: <https://builds.apache.org/job/Geode-nightly-flaky/ws/geode-rebalancer/src/main/java/org/apache/geode/cache/util/AutoBalancer.java>
uses or overrides a deprecated API.
Note: Recompile with -Xlint:deprecation for details.

:geode-rebalancer:processResources NO-SOURCE
:geode-rebalancer:classes
:geode-wan:compileJavaNote: <https://builds.apache.org/job/Geode-nightly-flaky/ws/geode-wan/src/main/java/org/apache/geode/internal/cache/wan/GatewaySenderFactoryImpl.java>
uses or overrides a deprecated API.
Note: Recompile with -Xlint:deprecation for details.

:geode-wan:processResources
:geode-wan:classes
:geode-web:compileJava NO-SOURCE
:geode-web:processResources NO-SOURCE
:geode-web:classes UP-TO-DATE
:geode-web-api:compileJava
Download https://repo1.maven.org/maven2/com/fasterxml/jackson/module/jackson-module-scala_2.10/2.8.6/jackson-module-scala_2.10-2.8.6.pom
Download https://repo1.maven.org/maven2/io/springfox/springfox-swagger2/2.6.1/springfox-swagger2-2.6.1.pom
Download https://repo1.maven.org/maven2/io/springfox/springfox-swagger-ui/2.6.1/springfox-swagger-ui-2.6.1.pom
Download https://repo1.maven.org/maven2/org/springframework/hateoas/spring-hateoas/0.23.0.RELEASE/spring-hateoas-0.23.0.RELEASE.pom
Download https://repo1.maven.org/maven2/org/scala-lang/scala-reflect/2.10.6/scala-reflect-2.10.6.pom
Download https://repo1.maven.org/maven2/com/fasterxml/jackson/module/jackson-module-paranamer/2.8.6/jackson-module-paranamer-2.8.6.pom
Download https://repo1.maven.org/maven2/com/fasterxml/jackson/module/jackson-modules-base/2.8.6/jackson-modules-base-2.8.6.pom
Download https://repo1.maven.org/maven2/com/fasterxml/jackson/jackson-bom/2.8.6/jackson-bom-2.8.6.pom
Download https://repo1.maven.org/maven2/io/swagger/swagger-annotations/1.5.10/swagger-annotations-1.5.10.pom
Download https://repo1.maven.org/maven2/io/swagger/swagger-project/1.5.10/swagger-project-1.5.10.pom
Download https://repo1.maven.org/maven2/io/swagger/swagger-models/1.5.10/swagger-models-1.5.10.pom
Download https://repo1.maven.org/maven2/io/springfox/springfox-spi/2.6.1/springfox-spi-2.6.1.pom
Download https://repo1.maven.org/maven2/io/springfox/springfox-schema/2.6.1/springfox-schema-2.6.1.pom
Download https://repo1.maven.org/maven2/io/springfox/springfox-swagger-common/2.6.1/springfox-swagger-common-2.6.1.pom
Download https://repo1.maven.org/maven2/io/springfox/springfox-spring-web/2.6.1/springfox-spring-web-2.6.1.pom
Download https://repo1.maven.org/maven2/com/fasterxml/classmate/1.3.1/classmate-1.3.1.pom
Download https://repo1.maven.org/maven2/org/springframework/plugin/spring-plugin-core/1.2.0.RELEASE/spring-plugin-core-1.2.0.RELEASE.pom
Download https://repo1.maven.org/maven2/org/springframework/plugin/spring-plugin/1.2.0.RELEASE/spring-plugin-1.2.0.RELEASE.pom
Download https://repo1.maven.org/maven2/org/springframework/plugin/spring-plugin-metadata/1.2.0.RELEASE/spring-plugin-metadata-1.2.0.RELEASE.pom
Download https://repo1.maven.org/maven2/org/mapstruct/mapstruct/1.0.0.Final/mapstruct-1.0.0.Final.pom
Download https://repo1.maven.org/maven2/org/mapstruct/mapstruct-parent/1.0.0.Final/mapstruct-parent-1.0.0.Final.pom
Download https://repo1.maven.org/maven2/io/springfox/springfox-core/2.6.1/springfox-core-2.6.1.pom
Download https://repo1.maven.org/maven2/com/fasterxml/jackson/module/jackson-module-scala_2.10/2.8.6/jackson-module-scala_2.10-2.8.6.jar
Download https://repo1.maven.org/maven2/io/springfox/springfox-swagger2/2.6.1/springfox-swagger2-2.6.1.jar
Download https://repo1.maven.org/maven2/io/springfox/springfox-swagger-ui/2.6.1/springfox-swagger-ui-2.6.1.jar
Download https://repo1.maven.org/maven2/org/springframework/hateoas/spring-hateoas/0.23.0.RELEASE/spring-hateoas-0.23.0.RELEASE.jar
Download https://repo1.maven.org/maven2/org/scala-lang/scala-reflect/2.10.6/scala-reflect-2.10.6.jar
Download https://repo1.maven.org/maven2/com/fasterxml/jackson/module/jackson-module-paranamer/2.8.6/jackson-module-paranamer-2.8.6.jar
Download https://repo1.maven.org/maven2/io/swagger/swagger-annotations/1.5.10/swagger-annotations-1.5.10.jar
Download https://repo1.maven.org/maven2/io/swagger/swagger-models/1.5.10/swagger-models-1.5.10.jar
Download https://repo1.maven.org/maven2/io/springfox/springfox-spi/2.6.1/springfox-spi-2.6.1.jar
Download https://repo1.maven.org/maven2/io/springfox/springfox-schema/2.6.1/springfox-schema-2.6.1.jar
Download https://repo1.maven.org/maven2/io/springfox/springfox-swagger-common/2.6.1/springfox-swagger-common-2.6.1.jar
Download https://repo1.maven.org/maven2/io/springfox/springfox-spring-web/2.6.1/springfox-spring-web-2.6.1.jar
Download https://repo1.maven.org/maven2/org/springframework/plugin/spring-plugin-core/1.2.0.RELEASE/spring-plugin-core-1.2.0.RELEASE.jar
Download https://repo1.maven.org/maven2/org/springframework/plugin/spring-plugin-metadata/1.2.0.RELEASE/spring-plugin-metadata-1.2.0.RELEASE.jar
Download https://repo1.maven.org/maven2/org/mapstruct/mapstruct/1.0.0.Final/mapstruct-1.0.0.Final.jar
Download https://repo1.maven.org/maven2/io/springfox/springfox-core/2.6.1/springfox-core-2.6.1.jar
Note: Some input files use or override a deprecated API.
Note: Recompile with -Xlint:deprecation for details.
Note: Some input files use unchecked or unsafe operations.
Note: Recompile with -Xlint:unchecked for details.
:geode-web-api:processResources
:geode-web-api:classes
:geode-assembly:docs
:geode-assembly:gfshDepsJar
:geode-client-protocol:javadoc
:geode-client-protocol:javadocJar
:geode-client-protocol:sourcesJar
:geode-client-protocol:signArchives SKIPPED
:geode-common:javadocJar
:geode-common:sourcesJar
:geode-common:signArchives SKIPPED
:geode-core:javadocJar
:geode-core:raJar
:geode-core:jcaJar
:geode-core:sourcesJar
:geode-core:signArchives SKIPPED
:geode-core:webJar
:geode-cq:jar
:geode-cq:javadoc
:geode-cq:javadocJar
:geode-cq:sourcesJar
:geode-cq:signArchives SKIPPED
:geode-json:javadocJar
:geode-json:sourcesJar
:geode-json:signArchives SKIPPED
:geode-lucene:jar
:geode-lucene:javadoc
:geode-lucene:javadocJar
:geode-lucene:sourcesJar
:geode-lucene:signArchives SKIPPED
:geode-old-client-support:jar
:geode-old-client-support:javadoc
:geode-old-client-support:javadocJar
:geode-old-client-support:sourcesJar
:geode-old-client-support:signArchives SKIPPED
:geode-protobuf:jar
:geode-protobuf-messages:javadoc
:geode-protobuf:javadoc
:geode-protobuf:javadocJar
:geode-protobuf:sourcesJar
:geode-protobuf:signArchives SKIPPED
:geode-protobuf-messages:javadocJar
:geode-protobuf-messages:sourcesJar
:geode-protobuf-messages:signArchives SKIPPED
:geode-protobuf-messages:zip
:geode-pulse:javadoc
:geode-pulse:javadocJar
:geode-pulse:sourcesJar
:geode-pulse:war
:geode-pulse:signArchives SKIPPED
:geode-rebalancer:jar
:geode-rebalancer:javadoc
:geode-rebalancer:javadocJar
:geode-rebalancer:sourcesJar
:geode-rebalancer:signArchives SKIPPED
:geode-wan:jar
:geode-wan:javadoc
:geode-wan:javadocJar
:geode-wan:sourcesJar
:geode-wan:signArchives SKIPPED
:geode-web:javadoc NO-SOURCE
:geode-web:javadocJar
:geode-web:sourcesJar
:geode-web:war
:geode-web:signArchives SKIPPED
:geode-web-api:javadoc
:geode-web-api:javadocJar
:geode-web-api:sourcesJar
:geode-web-api:war
:geode-web-api:signArchives SKIPPED
:geode-assembly:installDist
:geode-pulse:jar
:geode-assembly:compileTestJava
Download https://repo1.maven.org/maven2/org/codehaus/cargo/cargo-core-uberjar/1.6.3/cargo-core-uberjar-1.6.3.pom
Download https://repo1.maven.org/maven2/org/codehaus/cargo/cargo-core/1.6.3/cargo-core-1.6.3.pom
Download https://repo1.maven.org/maven2/org/codehaus/cargo/codehaus-cargo/1.6.3/codehaus-cargo-1.6.3.pom
Download https://repo1.maven.org/maven2/org/codehaus/cargo/cargo-core-uberjar/1.6.3/cargo-core-uberjar-1.6.3.jar
Note: Some input files use or override a deprecated API.
Note: Recompile with -Xlint:deprecation for details.
Note: Some input files use unchecked or unsafe operations.
Note: Recompile with -Xlint:unchecked for details.
:geode-assembly:processTestResources
:geode-assembly:testClasses
:geode-assembly:flakyTest

org.apache.geode.management.internal.cli.commands.LauncherLifecycleCommandsDUnitTest >
test014GemFireServerJvmProcessTerminatesOnOutOfMemoryError FAILED
    java.lang.AssertionError
        at org.junit.Assert.fail(Assert.java:86)
        at org.junit.Assert.assertTrue(Assert.java:41)
        at org.junit.Assert.assertTrue(Assert.java:52)
        at org.apache.geode.management.internal.cli.commands.LauncherLifecycleCommandsDUnitTest.test014GemFireServerJvmProcessTerminatesOnOutOfMemoryError(LauncherLifecycleCommandsDUnitTest.java:1018)

16 tests completed, 1 failed
:geode-assembly:flakyTest FAILED
:geode-benchmarks:compileTestJava NO-SOURCE
:geode-benchmarks:processTestResources NO-SOURCE
:geode-benchmarks:testClasses UP-TO-DATE
:geode-benchmarks:flakyTest NO-SOURCE
:geode-client-protocol:compileTestJava NO-SOURCE
:geode-client-protocol:processTestResources NO-SOURCE
:geode-client-protocol:testClasses UP-TO-DATE
:geode-client-protocol:flakyTest NO-SOURCE
:geode-common:compileTestJava
:geode-common:processTestResources NO-SOURCE
:geode-common:testClasses
:geode-common:flakyTest
:geode-concurrency-test:generateJpfProperties
:geode-concurrency-test:compileTestJava NO-SOURCE
:geode-concurrency-test:processTestResources NO-SOURCE
:geode-concurrency-test:testClasses UP-TO-DATE
:geode-concurrency-test:flakyTest NO-SOURCE
:geode-core:flakyTestjava.lang.ExceptionInInitializerError
	at worker.org.gradle.process.internal.worker.GradleWorkerMain.run(GradleWorkerMain.java:57)
	at worker.org.gradle.process.internal.worker.GradleWorkerMain.main(GradleWorkerMain.java:67)
Caused by: java.lang.NullPointerException
	at java.util.HashMap.get(HashMap.java:557)
	at sun.misc.JarIndex.get(JarIndex.java:179)
	at sun.misc.URLClassPath$JarLoader.getResource(URLClassPath.java:1071)
	at sun.misc.URLClassPath$JarLoader.getResource(URLClassPath.java:1050)
	at sun.misc.URLClassPath.getResource(URLClassPath.java:239)
	at java.net.URLClassLoader$1.run(URLClassLoader.java:365)
	at java.net.URLClassLoader$1.run(URLClassLoader.java:362)
	at java.security.AccessController.doPrivileged(Native Method)
	at java.net.URLClassLoader.findClass(URLClassLoader.java:361)
	at java.lang.ClassLoader.loadClass(ClassLoader.java:424)
	at java.lang.ClassLoader.loadClass(ClassLoader.java:411)
	at sun.misc.Launcher$AppClassLoader.loadClass(Launcher.java:338)
	at java.lang.ClassLoader.loadClass(ClassLoader.java:357)
	at worker.org.gradle.internal.classloader.FilteringClassLoader.<clinit>(FilteringClassLoader.java:49)
	... 2 more
 FAILED

FAILURE: Build failed with an exception.

* What went wrong:
Some child operations have not yet completed.

* Try:
Run with --stacktrace option to get the stack trace. Run with --info or --debug option to
get more log output.

BUILD FAILED

Total time: 1 hrs 32 mins 39.271 secs

FAILURE: Build failed with an exception.

* What went wrong:
Some build operations have not been marked as completed.

* Try:
Run with --stacktrace option to get the stack trace. Run with --info or --debug option to
get more log output.
Build step 'Invoke Gradle script' changed build result to FAILURE
Build step 'Invoke Gradle script' marked build as failure
Archiving artifacts
Recording test results

Mime
View raw message