geode-dev mailing list archives

Site index · List index
Message view « Date » · « Thread »
Top « Date » · « Thread »
From Apache Jenkins Server <jenk...@builds.apache.org>
Subject Build failed in Jenkins: Geode-nightly-flaky #165
Date Thu, 02 Nov 2017 05:47:32 GMT
See <https://builds.apache.org/job/Geode-nightly-flaky/165/display/redirect?page=changes>

Changes:

[github] GEODE-3539: Consolidate CliUtil and DataCommandUtils, DataCommandsUtil

[abaker] Restored SNAPSHOT releaseType

[jstewart] GEODE-3872: Remove executeAndVerify method

[lhughesgodfrey] GEODE-3338 Refactor WAN command tests to use new Rules

[kohlmu-pivotal] GEODE-3894: Create HandshakeRequest

[github] GEODE-3933: remove tests from the test suite and run them individually

[dbarnes] User Guide: fixed typo in a gfsh command option (start locator

[dbarnes] User Guide: fixed typo in the cluster config section

[dbarnes] User Guide: fixed language and command examples in the cluster config

[dbarnes] User Guide: Corrections to the cluster config deployment section

------------------------------------------
[...truncated 111.47 KB...]
Download https://repo1.maven.org/maven2/com/fasterxml/jackson/module/jackson-module-scala_2.10/2.8.6/jackson-module-scala_2.10-2.8.6.jar
Download https://repo1.maven.org/maven2/io/springfox/springfox-swagger2/2.6.1/springfox-swagger2-2.6.1.jar
Download https://repo1.maven.org/maven2/io/springfox/springfox-swagger-ui/2.6.1/springfox-swagger-ui-2.6.1.jar
Download https://repo1.maven.org/maven2/org/springframework/hateoas/spring-hateoas/0.23.0.RELEASE/spring-hateoas-0.23.0.RELEASE.jar
Download https://repo1.maven.org/maven2/com/fasterxml/jackson/module/jackson-module-paranamer/2.8.6/jackson-module-paranamer-2.8.6.jar
Download https://repo1.maven.org/maven2/io/swagger/swagger-annotations/1.5.10/swagger-annotations-1.5.10.jar
Download https://repo1.maven.org/maven2/io/swagger/swagger-models/1.5.10/swagger-models-1.5.10.jar
Download https://repo1.maven.org/maven2/io/springfox/springfox-spi/2.6.1/springfox-spi-2.6.1.jar
Download https://repo1.maven.org/maven2/io/springfox/springfox-schema/2.6.1/springfox-schema-2.6.1.jar
Download https://repo1.maven.org/maven2/io/springfox/springfox-swagger-common/2.6.1/springfox-swagger-common-2.6.1.jar
Download https://repo1.maven.org/maven2/io/springfox/springfox-spring-web/2.6.1/springfox-spring-web-2.6.1.jar
Download https://repo1.maven.org/maven2/org/springframework/plugin/spring-plugin-core/1.2.0.RELEASE/spring-plugin-core-1.2.0.RELEASE.jar
Download https://repo1.maven.org/maven2/org/springframework/plugin/spring-plugin-metadata/1.2.0.RELEASE/spring-plugin-metadata-1.2.0.RELEASE.jar
Download https://repo1.maven.org/maven2/org/mapstruct/mapstruct/1.0.0.Final/mapstruct-1.0.0.Final.jar
Download https://repo1.maven.org/maven2/com/thoughtworks/paranamer/paranamer/2.8/paranamer-2.8.jar
Download https://repo1.maven.org/maven2/io/springfox/springfox-core/2.6.1/springfox-core-2.6.1.jar
Note: Some input files use unchecked or unsafe operations.
Note: Recompile with -Xlint:unchecked for details.
:geode-web-api:processResources
:geode-web-api:classes
:geode-assembly:docs
:geode-assembly:gfshDepsJar
:geode-client-protocol:javadoc
:geode-client-protocol:javadocJar
:geode-client-protocol:sourcesJar
:geode-client-protocol:signArchives SKIPPED
:geode-common:javadocJar
:geode-common:sourcesJar
:geode-common:signArchives SKIPPED
:geode-core:javadocJar
:geode-core:raJar
:geode-core:jcaJar
:geode-core:sourcesJar
:geode-core:signArchives SKIPPED
:geode-core:webJar
:geode-cq:jar
:geode-cq:javadoc
:geode-cq:javadocJar
:geode-cq:sourcesJar
:geode-cq:signArchives SKIPPED
:geode-json:javadocJar
:geode-json:sourcesJar
:geode-json:signArchives SKIPPED
:geode-lucene:jar
:geode-lucene:javadoc
:geode-lucene:javadocJar
:geode-lucene:sourcesJar
:geode-lucene:signArchives SKIPPED
:geode-old-client-support:jar
:geode-old-client-support:javadoc
:geode-old-client-support:javadocJar
:geode-old-client-support:sourcesJar
:geode-old-client-support:signArchives SKIPPED
:geode-protobuf:jar
:geode-protobuf:javadoc
:geode-protobuf:javadocJar
:geode-protobuf:sourcesJar
:geode-protobuf:signArchives SKIPPED
:geode-protobuf:zip
:geode-pulse:javadoc
:geode-pulse:javadocJar
:geode-pulse:sourcesJar
:geode-pulse:war
:geode-pulse:signArchives SKIPPED
:geode-rebalancer:jar
:geode-rebalancer:javadoc
:geode-rebalancer:javadocJar
:geode-rebalancer:sourcesJar
:geode-rebalancer:signArchives SKIPPED
:geode-wan:jar
:geode-wan:javadoc
:geode-wan:javadocJar
:geode-wan:sourcesJar
:geode-wan:signArchives SKIPPED
:geode-web:javadoc NO-SOURCE
:geode-web:javadocJar
:geode-web:sourcesJar
:geode-web:war
:geode-web:signArchives SKIPPED
:geode-web-api:javadoc
:geode-web-api:javadocJar
:geode-web-api:sourcesJar
:geode-web-api:war
:geode-web-api:signArchives SKIPPED
:geode-assembly:installDist
:geode-pulse:jar
:geode-assembly:compileTestJava
Download https://repo1.maven.org/maven2/org/codehaus/cargo/cargo-core-uberjar/1.6.3/cargo-core-uberjar-1.6.3.pom
Download https://repo1.maven.org/maven2/org/codehaus/cargo/cargo-core/1.6.3/cargo-core-1.6.3.pom
Download https://repo1.maven.org/maven2/org/codehaus/cargo/codehaus-cargo/1.6.3/codehaus-cargo-1.6.3.pom
Download https://repo1.maven.org/maven2/org/codehaus/cargo/cargo-core-uberjar/1.6.3/cargo-core-uberjar-1.6.3.jar
Note: Some input files use or override a deprecated API.
Note: Recompile with -Xlint:deprecation for details.
Note: Some input files use unchecked or unsafe operations.
Note: Recompile with -Xlint:unchecked for details.
:geode-assembly:processTestResources
:geode-assembly:testClasses
:geode-assembly:flakyTest
:geode-benchmarks:compileTestJava NO-SOURCE
:geode-benchmarks:processTestResources NO-SOURCE
:geode-benchmarks:testClasses UP-TO-DATE
:geode-benchmarks:flakyTest NO-SOURCE
:geode-client-protocol:compileTestJava NO-SOURCE
:geode-client-protocol:processTestResources NO-SOURCE
:geode-client-protocol:testClasses UP-TO-DATE
:geode-client-protocol:flakyTest NO-SOURCE
:geode-common:compileTestJava
:geode-common:processTestResources NO-SOURCE
:geode-common:testClasses
:geode-common:flakyTest
:geode-concurrency-test:generateJpfProperties
:geode-concurrency-test:compileTestJava NO-SOURCE
:geode-concurrency-test:processTestResources NO-SOURCE
:geode-concurrency-test:testClasses UP-TO-DATE
:geode-concurrency-test:flakyTest NO-SOURCE
:geode-core:flakyTest

org.apache.geode.management.RegionManagementDUnitTest > testNavigationAPIS FAILED
    org.apache.geode.test.dunit.RMIException: While invoking org.apache.geode.test.dunit.NamedRunnable.run
in VM 0 running on Host asf914.gq1.ygridcore.net with 4 VMs
        at org.apache.geode.test.dunit.VM.invoke(VM.java:393)
        at org.apache.geode.test.dunit.VM.invoke(VM.java:363)
        at org.apache.geode.test.dunit.VM.invoke(VM.java:296)
        at org.apache.geode.management.RegionManagementDUnitTest.verifyNavigationApis(RegionManagementDUnitTest.java:406)
        at org.apache.geode.management.RegionManagementDUnitTest.testNavigationAPIS(RegionManagementDUnitTest.java:267)

        Caused by:
        org.awaitility.core.ConditionTimeoutException: Condition defined as a lambda expression
in org.apache.geode.management.RegionManagementDUnitTest that uses org.apache.geode.management.DistributedSystemMXBean,
org.apache.geode.management.DistributedSystemMXBeanint expected:<[4]> but was:<[5]>
within 2 minutes.
            at org.awaitility.core.ConditionAwaiter.await(ConditionAwaiter.java:104)
            at org.awaitility.core.AssertionCondition.await(AssertionCondition.java:117)
            at org.awaitility.core.AssertionCondition.await(AssertionCondition.java:32)
            at org.awaitility.core.ConditionFactory.until(ConditionFactory.java:809)
            at org.awaitility.core.ConditionFactory.until(ConditionFactory.java:648)
            at org.apache.geode.management.RegionManagementDUnitTest.awaitMemberCount(RegionManagementDUnitTest.java:1049)
            at org.apache.geode.management.RegionManagementDUnitTest.lambda$verifyNavigationApis$8ec4a763$1(RegionManagementDUnitTest.java:410)

283 tests completed, 1 failed, 8 skipped
:geode-core:flakyTest FAILED
:geode-cq:compileTestJavaNote: Some input files use or override a deprecated API.
Note: Recompile with -Xlint:deprecation for details.
Note: Some input files use unchecked or unsafe operations.
Note: Recompile with -Xlint:unchecked for details.

:geode-cq:processTestResources
:geode-cq:testClasses
:geode-cq:flakyTest
:geode-json:compileTestJava NO-SOURCE
:geode-json:processTestResources
:geode-json:testClasses
:geode-json:flakyTest NO-SOURCE
:geode-junit:compileTestJavaNote: <https://builds.apache.org/job/Geode-nightly-flaky/ws/geode-junit/src/test/java/org/apache/geode/test/compiler/JarBuilderTest.java>
uses or overrides a deprecated API.
Note: Recompile with -Xlint:deprecation for details.
Note: <https://builds.apache.org/job/Geode-nightly-flaky/ws/geode-junit/src/test/java/org/apache/geode/test/compiler/ClassNameExtractorTest.java>
uses unchecked or unsafe operations.
Note: Recompile with -Xlint:unchecked for details.

:geode-junit:processTestResources
:geode-junit:testClasses
:geode-junit:flakyTest
:geode-lucene:compileTestJava
Download https://repo1.maven.org/maven2/org/apache/lucene/lucene-test-framework/6.4.1/lucene-test-framework-6.4.1.pom
Download https://repo1.maven.org/maven2/org/apache/lucene/lucene-codecs/6.4.1/lucene-codecs-6.4.1.pom
Download https://repo1.maven.org/maven2/com/carrotsearch/randomizedtesting/randomizedtesting-runner/2.4.0/randomizedtesting-runner-2.4.0.pom
Download https://repo1.maven.org/maven2/com/carrotsearch/randomizedtesting/randomizedtesting-parent/2.4.0/randomizedtesting-parent-2.4.0.pom
Download https://repo1.maven.org/maven2/org/apache/lucene/lucene-test-framework/6.4.1/lucene-test-framework-6.4.1.jar
Download https://repo1.maven.org/maven2/org/apache/lucene/lucene-codecs/6.4.1/lucene-codecs-6.4.1.jar
Download https://repo1.maven.org/maven2/com/carrotsearch/randomizedtesting/randomizedtesting-runner/2.4.0/randomizedtesting-runner-2.4.0.jar
Note: Some input files use or override a deprecated API.
Note: Recompile with -Xlint:deprecation for details.
Note: Some input files use unchecked or unsafe operations.
Note: Recompile with -Xlint:unchecked for details.
:geode-lucene:processTestResources
:geode-lucene:testClasses
:geode-lucene:flakyTest
:geode-old-client-support:compileTestJavaNote: <https://builds.apache.org/job/Geode-nightly-flaky/ws/geode-old-client-support/src/test/java/com/gemstone/gemfire/cache/execute/FunctionExceptionTest.java>
uses or overrides a deprecated API.
Note: Recompile with -Xlint:deprecation for details.

:geode-old-client-support:processTestResources NO-SOURCE
:geode-old-client-support:testClasses
:geode-old-client-support:flakyTest
:geode-old-versions:compileTestJava NO-SOURCE
:geode-old-versions:processTestResources NO-SOURCE
:geode-old-versions:testClasses UP-TO-DATE
:geode-old-versions:flakyTest NO-SOURCE
:geode-protobuf:extractIncludeTestProto
Download https://repo1.maven.org/maven2/org/powermock/powermock-api-mockito/1.7.1/powermock-api-mockito-1.7.1.pom
Download https://repo1.maven.org/maven2/org/powermock/powermock-api-mockito/1.7.1/powermock-api-mockito-1.7.1.jar
:geode-protobuf:extractTestProto
:geode-protobuf:generateTestProto NO-SOURCE
:geode-protobuf:compileTestJavaNote: Some input files use or override a deprecated API.
Note: Recompile with -Xlint:deprecation for details.
Note: Some input files use unchecked or unsafe operations.
Note: Recompile with -Xlint:unchecked for details.

:geode-protobuf:processTestResources
:geode-protobuf:testClasses
:geode-protobuf:flakyTest
:geode-pulse:compileTestJava
Download https://repo1.maven.org/maven2/com/codeborne/phantomjsdriver/1.3.0/phantomjsdriver-1.3.0.pom
Download https://repo1.maven.org/maven2/com/codeborne/phantomjsdriver/1.3.0/phantomjsdriver-1.3.0.jar
Download https://repo1.maven.org/maven2/org/seleniumhq/selenium/selenium-api/3.0.1/selenium-api-3.0.1.jar
Download https://repo1.maven.org/maven2/org/seleniumhq/selenium/selenium-remote-driver/3.0.1/selenium-remote-driver-3.0.1.jar
Download https://repo1.maven.org/maven2/org/seleniumhq/selenium/selenium-support/3.0.1/selenium-support-3.0.1.jar
Note: Some input files use or override a deprecated API.
Note: Recompile with -Xlint:deprecation for details.
Note: <https://builds.apache.org/job/Geode-nightly-flaky/ws/geode-pulse/src/test/java/org/apache/geode/tools/pulse/controllers/PulseControllerJUnitTest.java>
uses unchecked or unsafe operations.
Note: Recompile with -Xlint:unchecked for details.
:geode-pulse:processTestResources
:geode-pulse:testClasses
:geode-pulse:flakyTest
:geode-rebalancer:compileTestJava
:geode-rebalancer:processTestResources NO-SOURCE
:geode-rebalancer:testClasses
:geode-rebalancer:flakyTest
:geode-wan:compileTestJavaNote: Some input files use or override a deprecated API.
Note: Recompile with -Xlint:deprecation for details.
Note: Some input files use unchecked or unsafe operations.
Note: Recompile with -Xlint:unchecked for details.

:geode-wan:processTestResources
:geode-wan:testClasses
:geode-wan:flakyTest
:geode-web:compileTestJavaNote: Some input files use or override a deprecated API.
Note: Recompile with -Xlint:deprecation for details.

:geode-web:processTestResources NO-SOURCE
:geode-web:testClasses
:geode-web:flakyTest
:geode-web-api:compileTestJava
:geode-web-api:processTestResources NO-SOURCE
:geode-web-api:testClasses
:geode-web-api:flakyTest
:combineReports
All test reports at <https://builds.apache.org/job/Geode-nightly-flaky/ws/build/reports/combined>

FAILURE: Build failed with an exception.

* What went wrong:
Execution failed for task ':geode-core:flakyTest'.
> There were failing tests. See the report at: file://<https://builds.apache.org/job/Geode-nightly-flaky/ws/geode-core/build/reports/flakyTest/index.html>

* Try:
Run with --stacktrace option to get the stack trace. Run with --info or --debug option to
get more log output.

BUILD FAILED

Total time: 2 hrs 1 mins 37.891 secs
Build step 'Invoke Gradle script' changed build result to FAILURE
Build step 'Invoke Gradle script' marked build as failure
Archiving artifacts
Recording test results

Mime
View raw message