geode-dev mailing list archives

Site index · List index
Message view « Date » · « Thread »
Top « Date » · « Thread »
From Apache Jenkins Server <jenk...@builds.apache.org>
Subject Build failed in Jenkins: Geode-nightly #1021
Date Wed, 22 Nov 2017 03:44:24 GMT
See <https://builds.apache.org/job/Geode-nightly/1021/display/redirect?page=changes>

Changes:

[github] GEODE-3341: Convert DiskStoreCommandsDUnitTest to use gfsh rules (#1062)

[jiliao] GEODE-2676: fix NPE with ShowMetricsCommand.

[github] GEODE-3539: Add missing test coverage for 'list regions' and 'describe

[github] GEODE-3980: Remove unneeded additional findAvailablePids calls (#1076)

[github] GEODE-3999: Prevent prematurely running out of heap (#1078)

[bschuchardt] commit dade94b3b5a3a3b2178a62e31edab27ccca40aa8 Merge: 526bcfc 73be2d9

[github] GEODE-2567: Add --if-exists to destroy disk-store (#1080)

[bschuchardt] GEODE-3995: Moving server_api.proto to locator_api.proto.

------------------------------------------
[...truncated 111.40 KB...]
        at org.apache.geode.test.junit.rules.gfsh.GfshScript.execute(GfshScript.java:105)
        at org.apache.geode.management.internal.cli.commands.StopServerWithSecurityAcceptanceTest.startCluster(StopServerWithSecurityAcceptanceTest.java:113)
        at org.apache.geode.management.internal.cli.commands.StopServerWithSecurityAcceptanceTest.cannotStopServerAsClusterReaderOverJmx(StopServerWithSecurityAcceptanceTest.java:90)

org.apache.geode.management.internal.cli.commands.StopServerWithSecurityAcceptanceTest >
cannotStopServerAsDataReaderOverHttp FAILED
    org.junit.ComparisonFailure: expected:<[0]> but was:<[1]>
        at sun.reflect.NativeConstructorAccessorImpl.newInstance0(Native Method)
        at sun.reflect.NativeConstructorAccessorImpl.newInstance(NativeConstructorAccessorImpl.java:62)
        at sun.reflect.DelegatingConstructorAccessorImpl.newInstance(DelegatingConstructorAccessorImpl.java:45)
        at org.apache.geode.test.junit.rules.gfsh.GfshScript.awaitIfNecessary(GfshScript.java:116)
        at org.apache.geode.test.junit.rules.gfsh.GfshRule.execute(GfshRule.java:94)
        at org.apache.geode.test.junit.rules.gfsh.GfshScript.execute(GfshScript.java:105)
        at org.apache.geode.management.internal.cli.commands.StopServerWithSecurityAcceptanceTest.startCluster(StopServerWithSecurityAcceptanceTest.java:113)
        at org.apache.geode.management.internal.cli.commands.StopServerWithSecurityAcceptanceTest.cannotStopServerAsDataReaderOverHttp(StopServerWithSecurityAcceptanceTest.java:60)

org.apache.geode.management.internal.cli.commands.StopServerWithSecurityAcceptanceTest >
cannotStopServerAsDataReaderOverJmx FAILED
    org.junit.ComparisonFailure: expected:<[0]> but was:<[1]>
        at sun.reflect.NativeConstructorAccessorImpl.newInstance0(Native Method)
        at sun.reflect.NativeConstructorAccessorImpl.newInstance(NativeConstructorAccessorImpl.java:62)
        at sun.reflect.DelegatingConstructorAccessorImpl.newInstance(DelegatingConstructorAccessorImpl.java:45)
        at org.apache.geode.test.junit.rules.gfsh.GfshScript.awaitIfNecessary(GfshScript.java:116)
        at org.apache.geode.test.junit.rules.gfsh.GfshRule.execute(GfshRule.java:94)
        at org.apache.geode.test.junit.rules.gfsh.GfshScript.execute(GfshScript.java:105)
        at org.apache.geode.management.internal.cli.commands.StopServerWithSecurityAcceptanceTest.startCluster(StopServerWithSecurityAcceptanceTest.java:113)
        at org.apache.geode.management.internal.cli.commands.StopServerWithSecurityAcceptanceTest.cannotStopServerAsDataReaderOverJmx(StopServerWithSecurityAcceptanceTest.java:75)

org.apache.geode.management.internal.cli.commands.StopServerWithSecurityAcceptanceTest >
canStopServerAsClusterAdminOverHttp FAILED
    org.junit.ComparisonFailure: expected:<[0]> but was:<[1]>
        at sun.reflect.NativeConstructorAccessorImpl.newInstance0(Native Method)
        at sun.reflect.NativeConstructorAccessorImpl.newInstance(NativeConstructorAccessorImpl.java:62)
        at sun.reflect.DelegatingConstructorAccessorImpl.newInstance(DelegatingConstructorAccessorImpl.java:45)
        at org.apache.geode.test.junit.rules.gfsh.GfshScript.awaitIfNecessary(GfshScript.java:116)
        at org.apache.geode.test.junit.rules.gfsh.GfshRule.execute(GfshRule.java:94)
        at org.apache.geode.test.junit.rules.gfsh.GfshScript.execute(GfshScript.java:105)
        at org.apache.geode.management.internal.cli.commands.StopServerWithSecurityAcceptanceTest.startCluster(StopServerWithSecurityAcceptanceTest.java:113)
        at org.apache.geode.management.internal.cli.commands.StopServerWithSecurityAcceptanceTest.canStopServerAsClusterAdminOverHttp(StopServerWithSecurityAcceptanceTest.java:68)

org.apache.geode.management.internal.cli.commands.StopServerAcceptanceTest > canStopServerByNameWhenConnectedOverJmx
FAILED
    org.junit.ComparisonFailure: expected:<[0]> but was:<[1]>
        at sun.reflect.NativeConstructorAccessorImpl.newInstance0(Native Method)
        at sun.reflect.NativeConstructorAccessorImpl.newInstance(NativeConstructorAccessorImpl.java:62)
        at sun.reflect.DelegatingConstructorAccessorImpl.newInstance(DelegatingConstructorAccessorImpl.java:45)
        at org.apache.geode.test.junit.rules.gfsh.GfshScript.awaitIfNecessary(GfshScript.java:116)
        at org.apache.geode.test.junit.rules.gfsh.GfshRule.execute(GfshRule.java:94)
        at org.apache.geode.test.junit.rules.gfsh.GfshRule.execute(GfshRule.java:83)
        at org.apache.geode.management.internal.cli.commands.StopServerAcceptanceTest.startCluster(StopServerAcceptanceTest.java:35)

org.apache.geode.management.internal.cli.commands.StopServerAcceptanceTest > cannotStopServerByNameWhenNotConnected
FAILED
    org.junit.ComparisonFailure: expected:<[0]> but was:<[1]>
        at sun.reflect.NativeConstructorAccessorImpl.newInstance0(Native Method)
        at sun.reflect.NativeConstructorAccessorImpl.newInstance(NativeConstructorAccessorImpl.java:62)
        at sun.reflect.DelegatingConstructorAccessorImpl.newInstance(DelegatingConstructorAccessorImpl.java:45)
        at org.apache.geode.test.junit.rules.gfsh.GfshScript.awaitIfNecessary(GfshScript.java:116)
        at org.apache.geode.test.junit.rules.gfsh.GfshRule.execute(GfshRule.java:94)
        at org.apache.geode.test.junit.rules.gfsh.GfshRule.execute(GfshRule.java:83)
        at org.apache.geode.management.internal.cli.commands.StopServerAcceptanceTest.startCluster(StopServerAcceptanceTest.java:35)

org.apache.geode.management.internal.cli.commands.StopServerAcceptanceTest > canStopServerByNameWhenConnectedOverHttp
FAILED
    org.junit.ComparisonFailure: expected:<[0]> but was:<[1]>
        at sun.reflect.NativeConstructorAccessorImpl.newInstance0(Native Method)
        at sun.reflect.NativeConstructorAccessorImpl.newInstance(NativeConstructorAccessorImpl.java:62)
        at sun.reflect.DelegatingConstructorAccessorImpl.newInstance(DelegatingConstructorAccessorImpl.java:45)
        at org.apache.geode.test.junit.rules.gfsh.GfshScript.awaitIfNecessary(GfshScript.java:116)
        at org.apache.geode.test.junit.rules.gfsh.GfshRule.execute(GfshRule.java:94)
        at org.apache.geode.test.junit.rules.gfsh.GfshRule.execute(GfshRule.java:83)
        at org.apache.geode.management.internal.cli.commands.StopServerAcceptanceTest.startCluster(StopServerAcceptanceTest.java:35)

org.apache.geode.management.internal.cli.commands.PutCommandWithJsonTest > putWithJsonString
FAILED
    org.junit.ComparisonFailure: expected:<[0]> but was:<[1]>
        at sun.reflect.NativeConstructorAccessorImpl.newInstance0(Native Method)
        at sun.reflect.NativeConstructorAccessorImpl.newInstance(NativeConstructorAccessorImpl.java:62)
        at sun.reflect.DelegatingConstructorAccessorImpl.newInstance(DelegatingConstructorAccessorImpl.java:45)
        at org.apache.geode.test.junit.rules.gfsh.GfshScript.awaitIfNecessary(GfshScript.java:116)
        at org.apache.geode.test.junit.rules.gfsh.GfshRule.execute(GfshRule.java:94)
        at org.apache.geode.test.junit.rules.gfsh.GfshScript.execute(GfshScript.java:105)
        at org.apache.geode.management.internal.cli.commands.PutCommandWithJsonTest.putWithJsonString(PutCommandWithJsonTest.java:58)

org.apache.geode.management.internal.cli.commands.GfshStartLocatorLogTest > bannerOnlyLogsOnce
FAILED
    org.junit.ComparisonFailure: expected:<[0]> but was:<[1]>
        at sun.reflect.NativeConstructorAccessorImpl.newInstance0(Native Method)
        at sun.reflect.NativeConstructorAccessorImpl.newInstance(NativeConstructorAccessorImpl.java:62)
        at sun.reflect.DelegatingConstructorAccessorImpl.newInstance(DelegatingConstructorAccessorImpl.java:45)
        at org.apache.geode.test.junit.rules.gfsh.GfshScript.awaitIfNecessary(GfshScript.java:116)
        at org.apache.geode.test.junit.rules.gfsh.GfshRule.execute(GfshRule.java:94)
        at org.apache.geode.test.junit.rules.gfsh.GfshScript.execute(GfshScript.java:105)
        at org.apache.geode.management.internal.cli.commands.GfshStartLocatorLogTest.getExecutionLogs(GfshStartLocatorLogTest.java:53)
        at org.apache.geode.management.internal.cli.commands.GfshStartLocatorLogTest.bannerOnlyLogsOnce(GfshStartLocatorLogTest.java:41)

org.apache.geode.management.internal.cli.commands.GfshStartLocatorLogTest > startupConfigsOnlyLogsOnce
FAILED
    org.junit.ComparisonFailure: expected:<[tru]e> but was:<[fals]e>
        at sun.reflect.NativeConstructorAccessorImpl.newInstance0(Native Method)
        at sun.reflect.NativeConstructorAccessorImpl.newInstance(NativeConstructorAccessorImpl.java:62)
        at sun.reflect.DelegatingConstructorAccessorImpl.newInstance(DelegatingConstructorAccessorImpl.java:45)
        at org.apache.geode.test.junit.rules.gfsh.GfshScript.awaitLoudly(GfshScript.java:141)
        at org.apache.geode.test.junit.rules.gfsh.GfshScript.awaitIfNecessary(GfshScript.java:112)
        at org.apache.geode.test.junit.rules.gfsh.GfshRule.execute(GfshRule.java:94)
        at org.apache.geode.test.junit.rules.gfsh.GfshScript.execute(GfshScript.java:105)
        at org.apache.geode.management.internal.cli.commands.GfshStartLocatorLogTest.getExecutionLogs(GfshStartLocatorLogTest.java:53)
        at org.apache.geode.management.internal.cli.commands.GfshStartLocatorLogTest.startupConfigsOnlyLogsOnce(GfshStartLocatorLogTest.java:48)

43 tests completed, 33 failed
:geode-assembly:acceptanceTest FAILED
:extensions/geode-modules-assembly:jar
:extensions/geode-modules-assembly:signArchives SKIPPED
:extensions/geode-modules-assembly:assemble
:extensions/geode-modules-assembly:compileTestJava NO-SOURCE
:extensions/geode-modules-assembly:processTestResources NO-SOURCE
:extensions/geode-modules-assembly:testClasses UP-TO-DATE
:extensions/geode-modules-assembly:checkMissedTests NO-SOURCE
:extensions/geode-modules-assembly:spotlessJavaCheck
:extensions/geode-modules-assembly:spotlessCheck
:extensions/geode-modules-assembly:test NO-SOURCE
:extensions/geode-modules-assembly:check
:extensions/geode-modules-assembly:build
:extensions/geode-modules-assembly:distributedTest NO-SOURCE
:extensions/geode-modules-assembly:integrationTest NO-SOURCE
:extensions/geode-modules-session:compileTestJavaNote: <https://builds.apache.org/job/Geode-nightly/ws/extensions/geode-modules-session/src/test/java/org/apache/geode/modules/session/installer/InstallerJUnitTest.java>
uses or overrides a deprecated API.
Note: Recompile with -Xlint:deprecation for details.

:extensions/geode-modules-session:processTestResources
:extensions/geode-modules-session:testClasses
:extensions/geode-modules-session:checkMissedTests
:extensions/geode-modules-session:spotlessJavaCheck
:extensions/geode-modules-session:spotlessCheck
:extensions/geode-modules-session:test
:extensions/geode-modules-session:check
:extensions/geode-modules-session:build
:extensions/geode-modules-session:distributedTest
:extensions/geode-modules-session:integrationTest
:extensions/geode-modules-session-internal:javadocJar
:extensions/geode-modules-session-internal:sourcesJar
:extensions/geode-modules-session-internal:signArchives SKIPPED
:extensions/geode-modules-session-internal:assemble
:extensions/geode-modules-session-internal:compileTestJava NO-SOURCE
:extensions/geode-modules-session-internal:processTestResources NO-SOURCE
:extensions/geode-modules-session-internal:testClasses UP-TO-DATE
:extensions/geode-modules-session-internal:checkMissedTests NO-SOURCE
:extensions/geode-modules-session-internal:spotlessJavaCheck
:extensions/geode-modules-session-internal:spotlessCheck
:extensions/geode-modules-session-internal:test NO-SOURCE
:extensions/geode-modules-session-internal:check
:extensions/geode-modules-session-internal:build
:extensions/geode-modules-session-internal:distributedTest NO-SOURCE
:extensions/geode-modules-session-internal:integrationTest NO-SOURCE
:extensions/geode-modules-tomcat7:compileTestJava
:extensions/geode-modules-tomcat7:processTestResources
:extensions/geode-modules-tomcat7:testClasses
:extensions/geode-modules-tomcat7:checkMissedTests
:extensions/geode-modules-tomcat7:spotlessJavaCheck
:extensions/geode-modules-tomcat7:spotlessCheck
:extensions/geode-modules-tomcat7:test
:extensions/geode-modules-tomcat7:check
:extensions/geode-modules-tomcat7:build
:extensions/geode-modules-tomcat7:distributedTest
:extensions/geode-modules-tomcat7:integrationTest
:extensions/geode-modules-tomcat8:compileTestJavaNote: Some input files use or override a
deprecated API.
Note: Recompile with -Xlint:deprecation for details.

:extensions/geode-modules-tomcat8:processTestResources
:extensions/geode-modules-tomcat8:testClasses
:extensions/geode-modules-tomcat8:checkMissedTests
:extensions/geode-modules-tomcat8:spotlessJavaCheck
:extensions/geode-modules-tomcat8:spotlessCheck
:extensions/geode-modules-tomcat8:test
:extensions/geode-modules-tomcat8:check
:extensions/geode-modules-tomcat8:build
:extensions/geode-modules-tomcat8:distributedTest
:extensions/geode-modules-tomcat8:integrationTest
:extensions/session-testing-war:javadoc
:extensions/session-testing-war:javadocJar
:extensions/session-testing-war:sourcesJar
:extensions/session-testing-war:war
:extensions/session-testing-war:signArchives SKIPPED
:extensions/session-testing-war:assemble
:extensions/session-testing-war:compileTestJava NO-SOURCE
:extensions/session-testing-war:processTestResources NO-SOURCE
:extensions/session-testing-war:testClasses UP-TO-DATE
:extensions/session-testing-war:checkMissedTests NO-SOURCE
:extensions/session-testing-war:spotlessJavaCheck
:extensions/session-testing-war:spotlessCheck
:extensions/session-testing-war:test NO-SOURCE
:extensions/session-testing-war:check
:extensions/session-testing-war:build
:extensions/session-testing-war:distributedTest NO-SOURCE
:extensions/session-testing-war:integrationTest NO-SOURCE
:geode-assembly:distTar
:geode-assembly:distZip
:geode-assembly:writeBuildInfo
:geode-assembly:srcDistTar
:geode-assembly:srcDistZip
:geode-assembly:signArchives SKIPPED
:geode-assembly:assemble
:geode-assembly:checkMissedTests
:geode-assembly:spotlessJavaCheck
:geode-assembly:spotlessCheck
:geode-assembly:test
:geode-assembly:check
:geode-assembly:build
:geode-old-versions:javadoc NO-SOURCE
:geode-old-versions:javadocJar
:geode-old-versions:sourcesJar
:geode-old-versions:signArchives SKIPPED
:geode-old-versions:assemble
:geode-old-versions:compileTestJava NO-SOURCE
:geode-old-versions:processTestResources NO-SOURCE
:geode-old-versions:testClasses UP-TO-DATE
:geode-old-versions:checkMissedTests NO-SOURCE
:geode-old-versions:spotlessJavaCheck
:geode-old-versions:spotlessCheck
:geode-old-versions:test NO-SOURCE
:geode-old-versions:check
:geode-old-versions:build
:geode-assembly:distributedTest

org.apache.geode.rest.internal.web.controllers.RestAPIsWithSSLDUnitTest > testSSLWithTLSv12ProtocolLegacy[1]
FAILED
    org.apache.geode.test.dunit.RMIException: While invoking org.apache.geode.test.dunit.NamedRunnable.run
in VM 3 running on Host asf934.gq1.ygridcore.net with 4 VMs
        at org.apache.geode.test.dunit.VM.invoke(VM.java:393)
        at org.apache.geode.test.dunit.VM.invoke(VM.java:363)
        at org.apache.geode.test.dunit.VM.invoke(VM.java:296)
        at org.apache.geode.rest.internal.web.controllers.RestAPIsWithSSLDUnitTest.startInfraWithSSL(RestAPIsWithSSLDUnitTest.java:258)
        at org.apache.geode.rest.internal.web.controllers.RestAPIsWithSSLDUnitTest.testSSLWithTLSv12ProtocolLegacy(RestAPIsWithSSLDUnitTest.java:769)

        Caused by:
        org.apache.geode.cache.client.ServerConnectivityException: Pool unexpected socket
timed out on client connection=Pooled Connection to asf934.gq1.ygridcore.net:42680: Connection[asf934.gq1.ygridcore.net:42680]@1604183855
attempt=2). Server unreachable: could not connect after 2 attempts
            at org.apache.geode.cache.client.internal.OpExecutorImpl.handleException(OpExecutorImpl.java:799)
            at org.apache.geode.cache.client.internal.OpExecutorImpl.handleException(OpExecutorImpl.java:624)
            at org.apache.geode.cache.client.internal.OpExecutorImpl.execute(OpExecutorImpl.java:175)
            at org.apache.geode.cache.client.internal.OpExecutorImpl.execute(OpExecutorImpl.java:116)
            at org.apache.geode.cache.client.internal.PoolImpl.execute(PoolImpl.java:774)
            at org.apache.geode.cache.client.internal.PutOp.execute(PutOp.java:91)
            at org.apache.geode.cache.client.internal.ServerRegionProxy.put(ServerRegionProxy.java:159)
            at org.apache.geode.internal.cache.LocalRegion.serverPut(LocalRegion.java:3001)
            at org.apache.geode.internal.cache.LocalRegion.cacheWriteBeforePut(LocalRegion.java:3110)
            at org.apache.geode.internal.cache.ProxyRegionMap.basicPut(ProxyRegionMap.java:242)
            at org.apache.geode.internal.cache.LocalRegion.virtualPut(LocalRegion.java:5617)
            at org.apache.geode.internal.cache.LocalRegionDataView.putEntry(LocalRegionDataView.java:152)
            at org.apache.geode.internal.cache.LocalRegion.basicPut(LocalRegion.java:5046)
            at org.apache.geode.internal.cache.LocalRegion.validatedPut(LocalRegion.java:1582)
            at org.apache.geode.internal.cache.LocalRegion.put(LocalRegion.java:1569)
            at org.apache.geode.internal.cache.AbstractRegion.put(AbstractRegion.java:325)
            at org.apache.geode.rest.internal.web.controllers.RestAPIsWithSSLDUnitTest.doPutsInClientCache(RestAPIsWithSSLDUnitTest.java:185)
            at org.apache.geode.rest.internal.web.controllers.RestAPIsWithSSLDUnitTest.lambda$startInfraWithSSL$1253249a$4(RestAPIsWithSSLDUnitTest.java:258)
Build timed out (after 1,440 minutes). Marking the build as failed.
Build was aborted
Archiving artifacts
[Fast Archiver] Compressed 331.16 MB of artifacts by 48.3% relative to #1019
Recording test results
Not sending mail to unregistered user github@nakomis.com
Not sending mail to unregistered user jiliao@pivotal.io

Mime
View raw message