geode-dev mailing list archives

Site index · List index
Message view « Date » · « Thread »
Top « Date » · « Thread »
From Apache Jenkins Server <jenk...@builds.apache.org>
Subject Build failed in Jenkins: Geode-release-flaky #41
Date Sat, 07 Oct 2017 09:03:03 GMT
See <https://builds.apache.org/job/Geode-release-flaky/41/display/redirect>

------------------------------------------
[...truncated 97.87 KB...]
Download https://repo1.maven.org/maven2/io/springfox/springfox-spring-web/2.6.1/springfox-spring-web-2.6.1.pom
Download https://repo1.maven.org/maven2/com/fasterxml/classmate/1.3.1/classmate-1.3.1.pom
Download https://repo1.maven.org/maven2/org/springframework/plugin/spring-plugin-core/1.2.0.RELEASE/spring-plugin-core-1.2.0.RELEASE.pom
Download https://repo1.maven.org/maven2/org/springframework/plugin/spring-plugin/1.2.0.RELEASE/spring-plugin-1.2.0.RELEASE.pom
Download https://repo1.maven.org/maven2/org/springframework/plugin/spring-plugin-metadata/1.2.0.RELEASE/spring-plugin-metadata-1.2.0.RELEASE.pom
Download https://repo1.maven.org/maven2/org/mapstruct/mapstruct/1.0.0.Final/mapstruct-1.0.0.Final.pom
Download https://repo1.maven.org/maven2/org/mapstruct/mapstruct-parent/1.0.0.Final/mapstruct-parent-1.0.0.Final.pom
Download https://repo1.maven.org/maven2/io/springfox/springfox-core/2.6.1/springfox-core-2.6.1.pom
Download https://repo1.maven.org/maven2/com/fasterxml/jackson/module/jackson-module-scala_2.10/2.8.6/jackson-module-scala_2.10-2.8.6.jar
Download https://repo1.maven.org/maven2/io/springfox/springfox-swagger2/2.6.1/springfox-swagger2-2.6.1.jar
Download https://repo1.maven.org/maven2/io/springfox/springfox-swagger-ui/2.6.1/springfox-swagger-ui-2.6.1.jar
Download https://repo1.maven.org/maven2/org/springframework/hateoas/spring-hateoas/0.23.0.RELEASE/spring-hateoas-0.23.0.RELEASE.jar
Download https://repo1.maven.org/maven2/com/fasterxml/jackson/module/jackson-module-paranamer/2.8.6/jackson-module-paranamer-2.8.6.jar
Download https://repo1.maven.org/maven2/io/springfox/springfox-spi/2.6.1/springfox-spi-2.6.1.jar
Download https://repo1.maven.org/maven2/io/springfox/springfox-schema/2.6.1/springfox-schema-2.6.1.jar
Download https://repo1.maven.org/maven2/io/springfox/springfox-swagger-common/2.6.1/springfox-swagger-common-2.6.1.jar
Download https://repo1.maven.org/maven2/io/springfox/springfox-spring-web/2.6.1/springfox-spring-web-2.6.1.jar
Download https://repo1.maven.org/maven2/org/springframework/plugin/spring-plugin-core/1.2.0.RELEASE/spring-plugin-core-1.2.0.RELEASE.jar
Download https://repo1.maven.org/maven2/org/springframework/plugin/spring-plugin-metadata/1.2.0.RELEASE/spring-plugin-metadata-1.2.0.RELEASE.jar
Download https://repo1.maven.org/maven2/org/mapstruct/mapstruct/1.0.0.Final/mapstruct-1.0.0.Final.jar
Download https://repo1.maven.org/maven2/io/springfox/springfox-core/2.6.1/springfox-core-2.6.1.jar
Note: Some input files use unchecked or unsafe operations.
Note: Recompile with -Xlint:unchecked for details.
:geode-web-api:processResources
:geode-web-api:classes
:geode-assembly:docs
:geode-assembly:gfshDepsJar
:geode-common:javadocJar
:geode-common:sourcesJar
:geode-common:signArchives SKIPPED
:geode-core:javadocJar
:geode-core:raJar
:geode-core:jcaJar
:geode-core:sourcesJar
:geode-core:signArchives SKIPPED
:geode-core:webJar
:geode-cq:jar
:geode-cq:javadoc
:geode-cq:javadocJar
:geode-cq:sourcesJar
:geode-cq:signArchives SKIPPED
:geode-json:javadocJar
:geode-json:sourcesJar
:geode-json:signArchives SKIPPED
:geode-lucene:jar
:geode-lucene:javadoc
:geode-lucene:javadocJar
:geode-lucene:sourcesJar
:geode-lucene:signArchives SKIPPED
:geode-old-client-support:jar
:geode-old-client-support:javadoc
:geode-old-client-support:javadocJar
:geode-old-client-support:sourcesJar
:geode-old-client-support:signArchives SKIPPED
:geode-pulse:javadoc
:geode-pulse:javadocJar
:geode-pulse:sourcesJar
:geode-pulse:war
:geode-pulse:signArchives SKIPPED
:geode-rebalancer:jar
:geode-rebalancer:javadoc
:geode-rebalancer:javadocJar
:geode-rebalancer:sourcesJar
:geode-rebalancer:signArchives SKIPPED
:geode-wan:jar
:geode-wan:javadoc
:geode-wan:javadocJar
:geode-wan:sourcesJar
:geode-wan:signArchives SKIPPED
:geode-web:javadoc UP-TO-DATE
:geode-web:javadocJar
:geode-web:sourcesJar
:geode-web:war
:geode-web:signArchives SKIPPED
:geode-web-api:javadoc
:geode-web-api:javadocJar
:geode-web-api:sourcesJar
:geode-web-api:war
:geode-web-api:signArchives SKIPPED
:geode-assembly:installDist
:geode-pulse:jar
:geode-assembly:compileTestJavaNote: Some input files use or override a deprecated API.
Note: Recompile with -Xlint:deprecation for details.
Note: Some input files use unchecked or unsafe operations.
Note: Recompile with -Xlint:unchecked for details.

:geode-assembly:processTestResources
:geode-assembly:testClasses
:geode-assembly:flakyTest
:geode-benchmarks:compileTestJava UP-TO-DATE
:geode-benchmarks:processTestResources UP-TO-DATE
:geode-benchmarks:testClasses UP-TO-DATE
:geode-benchmarks:flakyTest UP-TO-DATE
:geode-common:compileTestJava
:geode-common:processTestResources UP-TO-DATE
:geode-common:testClasses
:geode-common:flakyTest
:geode-core:flakyTestUnexpected exception thrown.
org.gradle.internal.remote.internal.MessageIOException: Could not write '/127.0.0.1:50227'.
	at org.gradle.internal.remote.internal.inet.SocketConnection.flush(SocketConnection.java:121)
	at org.gradle.internal.remote.internal.hub.MessageHub$ConnectionDispatch.run(MessageHub.java:300)
	at org.gradle.internal.concurrent.ExecutorPolicy$CatchAndRecordFailures.onExecute(ExecutorPolicy.java:54)
	at org.gradle.internal.concurrent.StoppableExecutorImpl$1.run(StoppableExecutorImpl.java:40)
	at java.util.concurrent.ThreadPoolExecutor.runWorker(ThreadPoolExecutor.java:1149)
	at java.util.concurrent.ThreadPoolExecutor$Worker.run(ThreadPoolExecutor.java:624)
	at java.lang.Thread.run(Thread.java:748)
Caused by: java.io.IOException: Broken pipe
	at sun.nio.ch.FileDispatcherImpl.write0(Native Method)
	at sun.nio.ch.SocketDispatcher.write(SocketDispatcher.java:47)
	at sun.nio.ch.IOUtil.writeFromNativeBuffer(IOUtil.java:93)
	at sun.nio.ch.IOUtil.write(IOUtil.java:51)
	at sun.nio.ch.SocketChannelImpl.write(SocketChannelImpl.java:471)
	at org.gradle.internal.remote.internal.inet.SocketConnection$SocketOutputStream.writeWithNonBlockingRetry(SocketConnection.java:259)
	at org.gradle.internal.remote.internal.inet.SocketConnection$SocketOutputStream.writeBufferToChannel(SocketConnection.java:247)
	at org.gradle.internal.remote.internal.inet.SocketConnection$SocketOutputStream.flush(SocketConnection.java:241)
	at org.gradle.internal.remote.internal.inet.SocketConnection.flush(SocketConnection.java:119)
	... 6 more
Unexpected exception thrown.
org.gradle.internal.remote.internal.MessageIOException: Could not read message from '/127.0.0.1:50227'.
	at org.gradle.internal.remote.internal.inet.SocketConnection.receive(SocketConnection.java:85)
	at org.gradle.internal.remote.internal.hub.MessageHub$ConnectionReceive.run(MessageHub.java:250)
	at org.gradle.internal.concurrent.ExecutorPolicy$CatchAndRecordFailures.onExecute(ExecutorPolicy.java:54)
	at org.gradle.internal.concurrent.StoppableExecutorImpl$1.run(StoppableExecutorImpl.java:40)
	at java.util.concurrent.ThreadPoolExecutor.runWorker(ThreadPoolExecutor.java:1149)
	at java.util.concurrent.ThreadPoolExecutor$Worker.run(ThreadPoolExecutor.java:624)
	at java.lang.Thread.run(Thread.java:748)
Caused by: java.lang.IllegalArgumentException
	at org.gradle.internal.remote.internal.hub.InterHubMessageSerializer$MessageReader.read(InterHubMessageSerializer.java:71)
	at org.gradle.internal.remote.internal.hub.InterHubMessageSerializer$MessageReader.read(InterHubMessageSerializer.java:52)
	at org.gradle.internal.remote.internal.inet.SocketConnection.receive(SocketConnection.java:78)
	... 6 more
org.gradle.internal.remote.internal.ConnectException: Could not connect to server [27380913-ee72-4dc4-9d6f-4e4e05aed0b0
port:50807, addresses:[/0:0:0:0:0:0:0:1, /127.0.0.1]]. Tried addresses: [/0:0:0:0:0:0:0:1,
/127.0.0.1].
	at org.gradle.internal.remote.internal.inet.TcpOutgoingConnector.connect(TcpOutgoingConnector.java:66)
	at org.gradle.internal.remote.internal.hub.MessageHubBackedClient.getConnection(MessageHubBackedClient.java:35)
	at org.gradle.process.internal.worker.child.SystemApplicationClassLoaderWorker.call(SystemApplicationClassLoaderWorker.java:71)
	at org.gradle.process.internal.worker.child.SystemApplicationClassLoaderWorker.call(SystemApplicationClassLoaderWorker.java:45)
	at worker.org.gradle.process.internal.worker.GradleWorkerMain.run(GradleWorkerMain.java:61)
	at worker.org.gradle.process.internal.worker.GradleWorkerMain.main(GradleWorkerMain.java:66)
Caused by: java.net.ConnectException: Connection refused
	at sun.nio.ch.SocketChannelImpl.checkConnect(Native Method)
	at sun.nio.ch.SocketChannelImpl.finishConnect(SocketChannelImpl.java:717)
	at sun.nio.ch.SocketAdaptor.connect(SocketAdaptor.java:111)
	at org.gradle.internal.remote.internal.inet.TcpOutgoingConnector.tryConnect(TcpOutgoingConnector.java:80)
	at org.gradle.internal.remote.internal.inet.TcpOutgoingConnector.connect(TcpOutgoingConnector.java:53)
	... 5 more
 FAILED
:geode-cq:compileTestJavaNote: Some input files use or override a deprecated API.
Note: Recompile with -Xlint:deprecation for details.
Note: Some input files use unchecked or unsafe operations.
Note: Recompile with -Xlint:unchecked for details.

:geode-cq:processTestResources
:geode-cq:testClasses
:geode-cq:flakyTest
:geode-json:compileTestJava UP-TO-DATE
:geode-json:processTestResources
:geode-json:testClasses
:geode-json:flakyTest UP-TO-DATE
:geode-junit:compileTestJavaNote: <https://builds.apache.org/job/Geode-release-flaky/ws/geode-junit/src/test/java/org/apache/geode/test/compiler/JarBuilderTest.java>
uses or overrides a deprecated API.
Note: Recompile with -Xlint:deprecation for details.
Note: <https://builds.apache.org/job/Geode-release-flaky/ws/geode-junit/src/test/java/org/apache/geode/test/compiler/ClassNameExtractorTest.java>
uses unchecked or unsafe operations.
Note: Recompile with -Xlint:unchecked for details.

:geode-junit:processTestResources
:geode-junit:testClasses
:geode-junit:flakyTest
:geode-lucene:compileTestJava
Download https://repo1.maven.org/maven2/org/apache/lucene/lucene-test-framework/6.4.1/lucene-test-framework-6.4.1.pom
Download https://repo1.maven.org/maven2/org/apache/lucene/lucene-codecs/6.4.1/lucene-codecs-6.4.1.pom
Download https://repo1.maven.org/maven2/org/apache/lucene/lucene-analyzers-phonetic/6.4.1/lucene-analyzers-phonetic-6.4.1.pom
Download https://repo1.maven.org/maven2/com/carrotsearch/randomizedtesting/randomizedtesting-runner/2.4.0/randomizedtesting-runner-2.4.0.pom
Download https://repo1.maven.org/maven2/com/carrotsearch/randomizedtesting/randomizedtesting-parent/2.4.0/randomizedtesting-parent-2.4.0.pom
Download https://repo1.maven.org/maven2/org/apache/lucene/lucene-test-framework/6.4.1/lucene-test-framework-6.4.1.jar
Download https://repo1.maven.org/maven2/org/apache/lucene/lucene-codecs/6.4.1/lucene-codecs-6.4.1.jar
Download https://repo1.maven.org/maven2/org/apache/lucene/lucene-analyzers-phonetic/6.4.1/lucene-analyzers-phonetic-6.4.1.jar
Download https://repo1.maven.org/maven2/com/carrotsearch/randomizedtesting/randomizedtesting-runner/2.4.0/randomizedtesting-runner-2.4.0.jar
Note: Some input files use or override a deprecated API.
Note: Recompile with -Xlint:deprecation for details.
Note: Some input files use unchecked or unsafe operations.
Note: Recompile with -Xlint:unchecked for details.
:geode-lucene:processTestResources
:geode-lucene:testClasses
:geode-lucene:flakyTest
:geode-old-client-support:compileTestJavaNote: <https://builds.apache.org/job/Geode-release-flaky/ws/geode-old-client-support/src/test/java/com/gemstone/gemfire/cache/execute/FunctionExceptionTest.java>
uses or overrides a deprecated API.
Note: Recompile with -Xlint:deprecation for details.

:geode-old-client-support:processTestResources UP-TO-DATE
:geode-old-client-support:testClasses
:geode-old-client-support:flakyTest
:geode-old-versions:compileTestJava UP-TO-DATE
:geode-old-versions:processTestResources UP-TO-DATE
:geode-old-versions:testClasses UP-TO-DATE
:geode-old-versions:flakyTest UP-TO-DATE
:geode-pulse:compileTestJava
Download https://repo1.maven.org/maven2/com/codeborne/phantomjsdriver/1.3.0/phantomjsdriver-1.3.0.pom
Download https://repo1.maven.org/maven2/com/codeborne/phantomjsdriver/1.3.0/phantomjsdriver-1.3.0.jar
Download https://repo1.maven.org/maven2/org/seleniumhq/selenium/selenium-api/3.0.1/selenium-api-3.0.1.jar
Download https://repo1.maven.org/maven2/org/seleniumhq/selenium/selenium-remote-driver/3.0.1/selenium-remote-driver-3.0.1.jar
Download https://repo1.maven.org/maven2/org/seleniumhq/selenium/selenium-support/3.0.1/selenium-support-3.0.1.jar
Note: <https://builds.apache.org/job/Geode-release-flaky/ws/geode-pulse/src/test/java/org/apache/geode/tools/pulse/tests/ui/PulseBase.java>
uses or overrides a deprecated API.
Note: Recompile with -Xlint:deprecation for details.
Note: <https://builds.apache.org/job/Geode-release-flaky/ws/geode-pulse/src/test/java/org/apache/geode/tools/pulse/controllers/PulseControllerJUnitTest.java>
uses unchecked or unsafe operations.
Note: Recompile with -Xlint:unchecked for details.
:geode-pulse:processTestResources
:geode-pulse:testClasses
:geode-pulse:flakyTest
:geode-rebalancer:compileTestJava
:geode-rebalancer:processTestResources UP-TO-DATE
:geode-rebalancer:testClasses
:geode-rebalancer:flakyTest
:geode-wan:compileTestJavaNote: Some input files use or override a deprecated API.
Note: Recompile with -Xlint:deprecation for details.
Note: Some input files use unchecked or unsafe operations.
Note: Recompile with -Xlint:unchecked for details.

:geode-wan:processTestResources
:geode-wan:testClasses
:geode-wan:flakyTest
:geode-web:compileTestJavaNote: Some input files use or override a deprecated API.
Note: Recompile with -Xlint:deprecation for details.
Note: Some input files use unchecked or unsafe operations.
Note: Recompile with -Xlint:unchecked for details.

:geode-web:processTestResources UP-TO-DATE
:geode-web:testClasses
:geode-web:flakyTest
:geode-web-api:compileTestJava
:geode-web-api:processTestResources UP-TO-DATE
:geode-web-api:testClasses
:geode-web-api:flakyTest
:combineReports
All test reports at <https://builds.apache.org/job/Geode-release-flaky/ws/build/reports/combined>

FAILURE: Build failed with an exception.

* What went wrong:
Execution failed for task ':geode-core:flakyTest'.
> Process 'Gradle Test Executor 1386' finished with non-zero exit value 1

* Try:
Run with --stacktrace option to get the stack trace. Run with --info or --debug option to
get more log output.

BUILD FAILED

Total time: 2 hrs 54 mins 32.556 secs
Build step 'Invoke Gradle script' changed build result to FAILURE
Build step 'Invoke Gradle script' marked build as failure
Archiving artifacts
Recording test results

Mime
View raw message