geode-dev mailing list archives

Site index · List index
Message view « Date » · « Thread »
Top « Date » · « Thread »
From Apache Jenkins Server <jenk...@builds.apache.org>
Subject Build failed in Jenkins: Geode-nightly #981
Date Wed, 11 Oct 2017 14:28:45 GMT
See <https://builds.apache.org/job/Geode-nightly/981/display/redirect?page=changes>

Changes:

[github] GEODE-1290: AbstractRegionEntry.prepareValueForCache cache the new

[github] GEODE-3785: correctly update the schema version, namespace and lcoatiā€¦

[browe] GEODE-3751: a single place for client protocol loading, logic.

[huynhja] GEODE-3714: Removed repetitive looping code when evaluating

[kohlmu-pivotal] GEODE-3802: moved Authenticator and Authorization classes to internal

[github] GEODE-3722 Revise one more instance of queryStrings (#901)

[github] GEODE-3740 Document diskTasksWaiting CachePerfStats statistic (#900)

[nabarunnag] GEODE-3131: Awaitility clause added to reference count verification.

[github] GEODE-3803: Added additional string methods to whitelist (#907)

[agingade] GEODE-3796 Changes are made to validate region version after the region

[agingade] GEODE-3796 Changes are made to validate region version after the region

------------------------------------------
[...truncated 142.56 KB...]
        at java.net.SocketInputStream.read(SocketInputStream.java:224)
        at com.google.protobuf.AbstractParser.parsePartialDelimitedFrom(AbstractParser.java:253)
        at com.google.protobuf.AbstractParser.parseDelimitedFrom(AbstractParser.java:275)
        at com.google.protobuf.AbstractParser.parseDelimitedFrom(AbstractParser.java:280)
        at com.google.protobuf.AbstractParser.parseDelimitedFrom(AbstractParser.java:49)
        at com.google.protobuf.GeneratedMessageV3.parseDelimitedWithIOException(GeneratedMessageV3.java:329)
        at org.apache.geode.internal.protocol.protobuf.AuthenticationAPI$SimpleAuthenticationResponse.parseDelimitedFrom(AuthenticationAPI.java:841)
        at org.apache.geode.internal.protocol.AuthorizationIntegrationTest.setUp(AuthorizationIntegrationTest.java:124)

org.apache.geode.internal.protocol.AuthenticationIntegrationTest > noopAuthenticationSucceeds
FAILED
    org.apache.geode.internal.protocol.exception.InvalidProtocolMessageException: Failed to
parse Protobuf Message
        at org.apache.geode.internal.protocol.protobuf.serializer.ProtobufProtocolSerializer.deserialize(ProtobufProtocolSerializer.java:34)
        at org.apache.geode.internal.protocol.AuthenticationIntegrationTest.noopAuthenticationSucceeds(AuthenticationIntegrationTest.java:119)

        Caused by:
        java.net.SocketException: Connection reset
            at java.net.SocketInputStream.read(SocketInputStream.java:210)
            at java.net.SocketInputStream.read(SocketInputStream.java:141)
            at java.net.SocketInputStream.read(SocketInputStream.java:224)
            at com.google.protobuf.AbstractParser.parsePartialDelimitedFrom(AbstractParser.java:253)
            at com.google.protobuf.AbstractParser.parseDelimitedFrom(AbstractParser.java:275)
            at com.google.protobuf.AbstractParser.parseDelimitedFrom(AbstractParser.java:280)
            at com.google.protobuf.AbstractParser.parseDelimitedFrom(AbstractParser.java:49)
            at com.google.protobuf.GeneratedMessageV3.parseDelimitedWithIOException(GeneratedMessageV3.java:329)
            at org.apache.geode.internal.protocol.protobuf.ClientProtocol$Message.parseDelimitedFrom(ClientProtocol.java:399)
            at org.apache.geode.internal.protocol.protobuf.serializer.ProtobufProtocolSerializer.deserialize(ProtobufProtocolSerializer.java:32)
            ... 1 more

org.apache.geode.internal.protocol.AuthenticationIntegrationTest > simpleAuthenticationSucceeds
FAILED
    java.lang.NullPointerException
        at org.apache.geode.internal.protocol.AuthenticationIntegrationTest.simpleAuthenticationSucceeds(AuthenticationIntegrationTest.java:134)

org.apache.geode.internal.protocol.acceptance.CacheOperationsJUnitTest > testResponseToGetWithNoData
FAILED
    java.net.SocketException: Broken pipe (Write failed)
        at java.net.SocketOutputStream.socketWrite0(Native Method)
        at java.net.SocketOutputStream.socketWrite(SocketOutputStream.java:111)
        at java.net.SocketOutputStream.write(SocketOutputStream.java:155)
        at com.google.protobuf.CodedOutputStream$OutputStreamEncoder.doFlush(CodedOutputStream.java:2997)
        at com.google.protobuf.CodedOutputStream$OutputStreamEncoder.flush(CodedOutputStream.java:2908)
        at com.google.protobuf.AbstractMessageLite.writeDelimitedTo(AbstractMessageLite.java:97)
        at org.apache.geode.internal.protocol.protobuf.serializer.ProtobufProtocolSerializer.serialize(ProtobufProtocolSerializer.java:41)
        at org.apache.geode.internal.protocol.acceptance.CacheOperationsJUnitTest.testResponseToGetWithNoData(CacheOperationsJUnitTest.java:246)

org.apache.geode.internal.protocol.acceptance.CacheOperationsJUnitTest > multiKeyOperationErrorsWithClasscastException
FAILED
    java.net.SocketException: Broken pipe (Write failed)
        at java.net.SocketOutputStream.socketWrite0(Native Method)
        at java.net.SocketOutputStream.socketWrite(SocketOutputStream.java:111)
        at java.net.SocketOutputStream.write(SocketOutputStream.java:155)
        at com.google.protobuf.CodedOutputStream$OutputStreamEncoder.doFlush(CodedOutputStream.java:2997)
        at com.google.protobuf.CodedOutputStream$OutputStreamEncoder.flush(CodedOutputStream.java:2908)
        at com.google.protobuf.AbstractMessageLite.writeDelimitedTo(AbstractMessageLite.java:97)
        at org.apache.geode.internal.protocol.protobuf.serializer.ProtobufProtocolSerializer.serialize(ProtobufProtocolSerializer.java:41)
        at org.apache.geode.internal.protocol.acceptance.CacheOperationsJUnitTest.multiKeyOperationErrorsWithClasscastException(CacheOperationsJUnitTest.java:219)

org.apache.geode.internal.protocol.acceptance.CacheOperationsJUnitTest > testNewProtocolGetRegionNamesCallSucceeds
FAILED
    java.net.SocketException: Broken pipe (Write failed)
        at java.net.SocketOutputStream.socketWrite0(Native Method)
        at java.net.SocketOutputStream.socketWrite(SocketOutputStream.java:111)
        at java.net.SocketOutputStream.write(SocketOutputStream.java:155)
        at com.google.protobuf.CodedOutputStream$OutputStreamEncoder.doFlush(CodedOutputStream.java:2997)
        at com.google.protobuf.CodedOutputStream$OutputStreamEncoder.flush(CodedOutputStream.java:2908)
        at com.google.protobuf.AbstractMessageLite.writeDelimitedTo(AbstractMessageLite.java:97)
        at org.apache.geode.internal.protocol.protobuf.serializer.ProtobufProtocolSerializer.serialize(ProtobufProtocolSerializer.java:41)
        at org.apache.geode.internal.protocol.acceptance.CacheOperationsJUnitTest.testNewProtocolGetRegionNamesCallSucceeds(CacheOperationsJUnitTest.java:268)

org.apache.geode.internal.protocol.acceptance.CacheOperationsJUnitTest > testNewProtocolWithMultikeyOperations
FAILED
    java.net.SocketException: Broken pipe (Write failed)
        at java.net.SocketOutputStream.socketWrite0(Native Method)
        at java.net.SocketOutputStream.socketWrite(SocketOutputStream.java:111)
        at java.net.SocketOutputStream.write(SocketOutputStream.java:155)
        at com.google.protobuf.CodedOutputStream$OutputStreamEncoder.doFlush(CodedOutputStream.java:2997)
        at com.google.protobuf.CodedOutputStream$OutputStreamEncoder.flush(CodedOutputStream.java:2908)
        at com.google.protobuf.AbstractMessageLite.writeDelimitedTo(AbstractMessageLite.java:97)
        at org.apache.geode.internal.protocol.protobuf.serializer.ProtobufProtocolSerializer.serialize(ProtobufProtocolSerializer.java:41)
        at org.apache.geode.internal.protocol.acceptance.CacheOperationsJUnitTest.testNewProtocolWithMultikeyOperations(CacheOperationsJUnitTest.java:175)

org.apache.geode.internal.protocol.acceptance.CacheOperationsJUnitTest > testNewProtocolGetRegionCall
FAILED
    java.lang.NullPointerException
        at org.apache.geode.internal.protocol.acceptance.CacheOperationsJUnitTest.testNewProtocolGetRegionCall(CacheOperationsJUnitTest.java:287)

org.apache.geode.internal.protocol.acceptance.CacheConnectionTimeoutJUnitTest > testUnresponsiveClientsGetDisconnected
FAILED
    java.net.SocketException: Broken pipe (Write failed)
        at java.net.SocketOutputStream.socketWrite0(Native Method)
        at java.net.SocketOutputStream.socketWrite(SocketOutputStream.java:111)
        at java.net.SocketOutputStream.write(SocketOutputStream.java:155)
        at com.google.protobuf.CodedOutputStream$OutputStreamEncoder.doFlush(CodedOutputStream.java:2997)
        at com.google.protobuf.CodedOutputStream$OutputStreamEncoder.flush(CodedOutputStream.java:2908)
        at com.google.protobuf.AbstractMessageLite.writeDelimitedTo(AbstractMessageLite.java:97)
        at org.apache.geode.internal.protocol.protobuf.serializer.ProtobufProtocolSerializer.serialize(ProtobufProtocolSerializer.java:41)
        at org.apache.geode.internal.protocol.acceptance.CacheConnectionTimeoutJUnitTest.testUnresponsiveClientsGetDisconnected(CacheConnectionTimeoutJUnitTest.java:139)

org.apache.geode.internal.protocol.acceptance.CacheConnectionTimeoutJUnitTest > testResponsiveClientsStaysConnected
FAILED
    java.net.SocketException: Connection reset
        at java.net.SocketInputStream.read(SocketInputStream.java:210)
        at java.net.SocketInputStream.read(SocketInputStream.java:141)
        at java.net.SocketInputStream.read(SocketInputStream.java:224)
        at org.apache.geode.internal.protocol.acceptance.CacheConnectionTimeoutJUnitTest.testResponsiveClientsStaysConnected(CacheConnectionTimeoutJUnitTest.java:164)

13 tests completed, 13 failed
:geode-protobuf:integrationTest FAILED
:geode-pulse:assemble
:geode-pulse:compileTestJavaNote: Some input files use or override a deprecated API.
Note: Recompile with -Xlint:deprecation for details.
Note: <https://builds.apache.org/job/Geode-nightly/ws/geode-pulse/src/test/java/org/apache/geode/tools/pulse/controllers/PulseControllerJUnitTest.java>
uses unchecked or unsafe operations.
Note: Recompile with -Xlint:unchecked for details.

:geode-pulse:processTestResources
:geode-pulse:testClasses
:geode-pulse:checkMissedTests
:geode-pulse:spotlessJavaCheck
:geode-pulse:spotlessCheck
:geode-pulse:test
:geode-pulse:check
:geode-pulse:build
:geode-pulse:distributedTest
:geode-pulse:integrationTest
:geode-rebalancer:assemble
:geode-rebalancer:compileTestJava
:geode-rebalancer:processTestResources NO-SOURCE
:geode-rebalancer:testClasses
:geode-rebalancer:checkMissedTests
:geode-rebalancer:spotlessJavaCheck
:geode-rebalancer:spotlessCheck
:geode-rebalancer:test
:geode-rebalancer:check
:geode-rebalancer:build
:geode-rebalancer:distributedTest
:geode-rebalancer:integrationTest
:geode-wan:assemble
:geode-wan:compileTestJavaNote: Some input files use or override a deprecated API.
Note: Recompile with -Xlint:deprecation for details.
Note: Some input files use unchecked or unsafe operations.
Note: Recompile with -Xlint:unchecked for details.

:geode-wan:processTestResources
:geode-wan:testClasses
:geode-wan:checkMissedTests
:geode-wan:spotlessJavaCheck
:geode-wan:spotlessCheck
:geode-wan:test
:geode-wan:check
:geode-wan:build
:geode-wan:distributedTest
:geode-wan:integrationTest
:geode-web:assemble
:geode-web:compileTestJavaNote: Some input files use or override a deprecated API.
Note: Recompile with -Xlint:deprecation for details.

:geode-web:processTestResources NO-SOURCE
:geode-web:testClasses
:geode-web:checkMissedTests
:geode-web:spotlessJavaCheck
:geode-web:spotlessCheck
:geode-web:test
:geode-web:check
:geode-web:build
:geode-web:distributedTest
:geode-web:integrationTest
:geode-web-api:assemble
:geode-web-api:compileTestJava
:geode-web-api:processTestResources NO-SOURCE
:geode-web-api:testClasses
:geode-web-api:checkMissedTests
:geode-web-api:spotlessJavaCheck
:geode-web-api:spotlessCheck
:geode-web-api:test
:geode-web-api:check
:geode-web-api:build
:geode-web-api:distributedTest
:geode-web-api:integrationTest
:combineReports
All test reports at <https://builds.apache.org/job/Geode-nightly/ws/build/reports/combined>
:extensions/geode-modules:precheckin
:extensions/geode-modules-assembly:precheckin
:extensions/geode-modules-session:precheckin
:extensions/geode-modules-session-internal:precheckin
:extensions/geode-modules-tomcat7:precheckin
:extensions/geode-modules-tomcat8:precheckin
:extensions/session-testing-war:precheckin
:geode-assembly:precheckin
:geode-benchmarks:precheckin
:geode-common:precheckin
:geode-concurrency-test:precheckin
:geode-core:precheckin
:geode-cq:precheckin
:geode-json:precheckin
:geode-junit:precheckin
:geode-lucene:precheckin
:geode-old-client-support:precheckin
:geode-old-versions:precheckin
:geode-pulse:precheckin
:geode-rebalancer:precheckin
:geode-wan:precheckin
:geode-web:precheckin
:geode-web-api:precheckin
:compileJava NO-SOURCE
:processResources NO-SOURCE
:classes UP-TO-DATE
:jar
:uploadArchives
:extensions/geode-modules:uploadArchives SKIPPED
:extensions/geode-modules-assembly:uploadArchives
:extensions/geode-modules-session:uploadArchives SKIPPED
:extensions/geode-modules-session-internal:uploadArchives SKIPPED
:extensions/geode-modules-tomcat7:uploadArchives SKIPPED
:extensions/geode-modules-tomcat8:uploadArchives SKIPPED
:extensions/session-testing-war:uploadArchives SKIPPED
:geode-assembly:uploadArchives
:geode-benchmarks:uploadArchives SKIPPED
:geode-common:uploadArchives
:geode-concurrency-test:uploadArchives
:geode-core:uploadArchives
:geode-cq:uploadArchives
:geode-json:uploadArchives
:geode-junit:uploadArchives
:geode-lucene:uploadArchives
:geode-old-client-support:uploadArchives
:geode-old-versions:uploadArchives SKIPPED
:geode-protobuf:uploadArchives
:geode-pulse:uploadArchives
:geode-rebalancer:uploadArchives
:geode-wan:uploadArchives
:geode-web:uploadArchives
:geode-web-api:uploadArchives

FAILURE: Build failed with an exception.

* What went wrong:
Execution failed for task ':geode-protobuf:integrationTest'.
> There were failing tests. See the report at: file://<https://builds.apache.org/job/Geode-nightly/ws/geode-protobuf/build/reports/integrationTest/index.html>

* Try:
Run with --stacktrace option to get the stack trace. Run with --info or --debug option to
get more log output.

BUILD FAILED

Total time: 10 hrs 43 mins 11.984 secs
Build step 'Invoke Gradle script' changed build result to FAILURE
Build step 'Invoke Gradle script' marked build as failure
Archiving artifacts
[Fast Archiver] Compressed 336.08 MB of artifacts by 53.1% relative to #978
Recording test results
Not sending mail to unregistered user browe@pivotal.io
Not sending mail to unregistered user dsmith@pivotal.io
Not sending mail to unregistered user huynhja@gmail.com
Not sending mail to unregistered user kohlmu-pivotal@users.noreply.github.com
Not sending mail to unregistered user nabarunnag@users.noreply.github.com
Not sending mail to unregistered user kirk.lund@gmail.com
Not sending mail to unregistered user github@nakomis.com

Mime
View raw message