geode-dev mailing list archives

Site index · List index
Message view « Date » · « Thread »
Top « Date » · « Thread »
From Apache Jenkins Server <jenk...@builds.apache.org>
Subject Build failed in Jenkins: Geode-nightly #951
Date Mon, 11 Sep 2017 13:54:10 GMT
See <https://builds.apache.org/job/Geode-nightly/951/display/redirect>

------------------------------------------
[...truncated 156.06 KB...]
:geode-pulse:uploadArchives FAILED
:geode-rebalancer:uploadArchives FAILED
:geode-wan:uploadArchives FAILED
:geode-web:uploadArchives FAILED
:geode-web-api:uploadArchives FAILED

FAILURE: Build completed with 15 failures.

1: Task failed with an exception.
-----------
* What went wrong:
Execution failed for task ':geode-assembly:integrationTest'.
> There were failing tests. See the report at: file://<https://builds.apache.org/job/Geode-nightly/ws/geode-assembly/build/reports/integrationTest/index.html>

* Try:
Run with --stacktrace option to get the stack trace. Run with --info or --debug option to
get more log output.
==============================================================================

2: Task failed with an exception.
-----------
* Where:
Script '<https://builds.apache.org/job/Geode-nightly/ws/gradle/publish.gradle'> line:
116

* What went wrong:
Execution failed for task ':extensions/geode-modules-assembly:uploadArchives'.
> Could not find which method repositories() to invoke from this list:
    public org.gradle.api.artifacts.dsl.RepositoryHandler org.gradle.api.tasks.Upload#repositories(groovy.lang.Closure)
    public org.gradle.api.artifacts.dsl.RepositoryHandler org.gradle.api.tasks.Upload#repositories(org.gradle.api.Action)

* Try:
Run with --stacktrace option to get the stack trace. Run with --info or --debug option to
get more log output.
==============================================================================

3: Task failed with an exception.
-----------
* Where:
Script '<https://builds.apache.org/job/Geode-nightly/ws/gradle/publish.gradle'> line:
116

* What went wrong:
Execution failed for task ':geode-common:uploadArchives'.
> Could not find which method repositories() to invoke from this list:
    public org.gradle.api.artifacts.dsl.RepositoryHandler org.gradle.api.tasks.Upload#repositories(groovy.lang.Closure)
    public org.gradle.api.artifacts.dsl.RepositoryHandler org.gradle.api.tasks.Upload#repositories(org.gradle.api.Action)

* Try:
Run with --stacktrace option to get the stack trace. Run with --info or --debug option to
get more log output.
==============================================================================

4: Task failed with an exception.
-----------
* Where:
Script '<https://builds.apache.org/job/Geode-nightly/ws/gradle/publish.gradle'> line:
116

* What went wrong:
Execution failed for task ':geode-core:uploadArchives'.
> Could not find which method repositories() to invoke from this list:
    public org.gradle.api.artifacts.dsl.RepositoryHandler org.gradle.api.tasks.Upload#repositories(groovy.lang.Closure)
    public org.gradle.api.artifacts.dsl.RepositoryHandler org.gradle.api.tasks.Upload#repositories(org.gradle.api.Action)

* Try:
Run with --stacktrace option to get the stack trace. Run with --info or --debug option to
get more log output.
==============================================================================

5: Task failed with an exception.
-----------
* Where:
Script '<https://builds.apache.org/job/Geode-nightly/ws/gradle/publish.gradle'> line:
116

* What went wrong:
Execution failed for task ':geode-cq:uploadArchives'.
> Could not find which method repositories() to invoke from this list:
    public org.gradle.api.artifacts.dsl.RepositoryHandler org.gradle.api.tasks.Upload#repositories(groovy.lang.Closure)
    public org.gradle.api.artifacts.dsl.RepositoryHandler org.gradle.api.tasks.Upload#repositories(org.gradle.api.Action)

* Try:
Run with --stacktrace option to get the stack trace. Run with --info or --debug option to
get more log output.
==============================================================================

6: Task failed with an exception.
-----------
* Where:
Script '<https://builds.apache.org/job/Geode-nightly/ws/gradle/publish.gradle'> line:
116

* What went wrong:
Execution failed for task ':geode-json:uploadArchives'.
> Could not find which method repositories() to invoke from this list:
    public org.gradle.api.artifacts.dsl.RepositoryHandler org.gradle.api.tasks.Upload#repositories(groovy.lang.Closure)
    public org.gradle.api.artifacts.dsl.RepositoryHandler org.gradle.api.tasks.Upload#repositories(org.gradle.api.Action)

* Try:
Run with --stacktrace option to get the stack trace. Run with --info or --debug option to
get more log output.
==============================================================================

7: Task failed with an exception.
-----------
* Where:
Script '<https://builds.apache.org/job/Geode-nightly/ws/gradle/publish.gradle'> line:
116

* What went wrong:
Execution failed for task ':geode-junit:uploadArchives'.
> Could not find which method repositories() to invoke from this list:
    public org.gradle.api.artifacts.dsl.RepositoryHandler org.gradle.api.tasks.Upload#repositories(groovy.lang.Closure)
    public org.gradle.api.artifacts.dsl.RepositoryHandler org.gradle.api.tasks.Upload#repositories(org.gradle.api.Action)

* Try:
Run with --stacktrace option to get the stack trace. Run with --info or --debug option to
get more log output.
==============================================================================

8: Task failed with an exception.
-----------
* Where:
Script '<https://builds.apache.org/job/Geode-nightly/ws/gradle/publish.gradle'> line:
116

* What went wrong:
Execution failed for task ':geode-lucene:uploadArchives'.
> Could not find which method repositories() to invoke from this list:
    public org.gradle.api.artifacts.dsl.RepositoryHandler org.gradle.api.tasks.Upload#repositories(groovy.lang.Closure)
    public org.gradle.api.artifacts.dsl.RepositoryHandler org.gradle.api.tasks.Upload#repositories(org.gradle.api.Action)

* Try:
Run with --stacktrace option to get the stack trace. Run with --info or --debug option to
get more log output.
==============================================================================

9: Task failed with an exception.
-----------
* Where:
Script '<https://builds.apache.org/job/Geode-nightly/ws/gradle/publish.gradle'> line:
116

* What went wrong:
Execution failed for task ':geode-old-client-support:uploadArchives'.
> Could not find which method repositories() to invoke from this list:
    public org.gradle.api.artifacts.dsl.RepositoryHandler org.gradle.api.tasks.Upload#repositories(groovy.lang.Closure)
    public org.gradle.api.artifacts.dsl.RepositoryHandler org.gradle.api.tasks.Upload#repositories(org.gradle.api.Action)

* Try:
Run with --stacktrace option to get the stack trace. Run with --info or --debug option to
get more log output.
==============================================================================

10: Task failed with an exception.
-----------
* Where:
Script '<https://builds.apache.org/job/Geode-nightly/ws/gradle/publish.gradle'> line:
116

* What went wrong:
Execution failed for task ':geode-protobuf:uploadArchives'.
> Could not find which method repositories() to invoke from this list:
    public org.gradle.api.artifacts.dsl.RepositoryHandler org.gradle.api.tasks.Upload#repositories(groovy.lang.Closure)
    public org.gradle.api.artifacts.dsl.RepositoryHandler org.gradle.api.tasks.Upload#repositories(org.gradle.api.Action)

* Try:
Run with --stacktrace option to get the stack trace. Run with --info or --debug option to
get more log output.
==============================================================================

11: Task failed with an exception.
-----------
* Where:
Script '<https://builds.apache.org/job/Geode-nightly/ws/gradle/publish.gradle'> line:
116

* What went wrong:
Execution failed for task ':geode-pulse:uploadArchives'.
> Could not find which method repositories() to invoke from this list:
    public org.gradle.api.artifacts.dsl.RepositoryHandler org.gradle.api.tasks.Upload#repositories(groovy.lang.Closure)
    public org.gradle.api.artifacts.dsl.RepositoryHandler org.gradle.api.tasks.Upload#repositories(org.gradle.api.Action)

* Try:
Run with --stacktrace option to get the stack trace. Run with --info or --debug option to
get more log output.
==============================================================================

12: Task failed with an exception.
-----------
* Where:
Script '<https://builds.apache.org/job/Geode-nightly/ws/gradle/publish.gradle'> line:
116

* What went wrong:
Execution failed for task ':geode-rebalancer:uploadArchives'.
> Could not find which method repositories() to invoke from this list:
    public org.gradle.api.artifacts.dsl.RepositoryHandler org.gradle.api.tasks.Upload#repositories(groovy.lang.Closure)
    public org.gradle.api.artifacts.dsl.RepositoryHandler org.gradle.api.tasks.Upload#repositories(org.gradle.api.Action)

* Try:
Run with --stacktrace option to get the stack trace. Run with --info or --debug option to
get more log output.
==============================================================================

13: Task failed with an exception.
-----------
* Where:
Script '<https://builds.apache.org/job/Geode-nightly/ws/gradle/publish.gradle'> line:
116

* What went wrong:
Execution failed for task ':geode-wan:uploadArchives'.
> Could not find which method repositories() to invoke from this list:
    public org.gradle.api.artifacts.dsl.RepositoryHandler org.gradle.api.tasks.Upload#repositories(groovy.lang.Closure)
    public org.gradle.api.artifacts.dsl.RepositoryHandler org.gradle.api.tasks.Upload#repositories(org.gradle.api.Action)

* Try:
Run with --stacktrace option to get the stack trace. Run with --info or --debug option to
get more log output.
==============================================================================

14: Task failed with an exception.
-----------
* Where:
Script '<https://builds.apache.org/job/Geode-nightly/ws/gradle/publish.gradle'> line:
116

* What went wrong:
Execution failed for task ':geode-web:uploadArchives'.
> Could not find which method repositories() to invoke from this list:
    public org.gradle.api.artifacts.dsl.RepositoryHandler org.gradle.api.tasks.Upload#repositories(groovy.lang.Closure)
    public org.gradle.api.artifacts.dsl.RepositoryHandler org.gradle.api.tasks.Upload#repositories(org.gradle.api.Action)

* Try:
Run with --stacktrace option to get the stack trace. Run with --info or --debug option to
get more log output.
==============================================================================

15: Task failed with an exception.
-----------
* Where:
Script '<https://builds.apache.org/job/Geode-nightly/ws/gradle/publish.gradle'> line:
116

* What went wrong:
Execution failed for task ':geode-web-api:uploadArchives'.
> Could not find which method repositories() to invoke from this list:
    public org.gradle.api.artifacts.dsl.RepositoryHandler org.gradle.api.tasks.Upload#repositories(groovy.lang.Closure)
    public org.gradle.api.artifacts.dsl.RepositoryHandler org.gradle.api.tasks.Upload#repositories(org.gradle.api.Action)

* Try:
Run with --stacktrace option to get the stack trace. Run with --info or --debug option to
get more log output.
==============================================================================

BUILD FAILED

Total time: 10 hrs 8 mins 9.96 secs
Build step 'Invoke Gradle script' changed build result to FAILURE
Build step 'Invoke Gradle script' marked build as failure
Archiving artifacts
[Fast Archiver] Compressed 337.10 MB of artifacts by 35.3% relative to #914
Recording test results
ERROR: Step ?Publish JUnit test result report? failed: No test report files were found. Configuration
error?
Not sending mail to unregistered user jiliao@pivotal.io
Not sending mail to unregistered user lhughesgodfrey@pivotal.io
Not sending mail to unregistered user sjewll@pivotal.io
Not sending mail to unregistered user huynhja@gmail.com
Not sending mail to unregistered user jdeppe@gopivotal.com
Not sending mail to unregistered user eshu@pivotal.io
Not sending mail to unregistered user metatype@users.noreply.github.com
Not sending mail to unregistered user gzhou@pivotal.io
Not sending mail to unregistered user dcavender@pivotal.io
Not sending mail to unregistered user hiteshk25@yahoo.com
Not sending mail to unregistered user hkhamesra@pivotal.io
Not sending mail to unregistered user ukohlmeyer@pivotal.io

Mime
View raw message