geode-dev mailing list archives

Site index · List index
Message view « Date » · « Thread »
Top « Date » · « Thread »
From Apache Jenkins Server <jenk...@builds.apache.org>
Subject Build failed in Jenkins: Geode-nightly-flaky #128
Date Thu, 21 Sep 2017 13:04:14 GMT
See <https://builds.apache.org/job/Geode-nightly-flaky/128/display/redirect?page=changes>

Changes:

[abaker] Update version on release branch

[abaker] GEODE-2947: Error message is now specific to lucene indexes

[jiliao] GEODE-3006: reduce the frequency of ping request and reduce the loglevel

[jiliao] GEODE-2983: correctly handling --J option value that has "," inside.

[jstewart] GEODE-2989: Improve mechanism for scanning the classpath to find gfsh

[jstewart] GEODE-2966: RefactorLauncherLifecycleCommands

[jstewart] GEODE-2966: Restore command changes lost in merge conflict

[kmiller] GEODE-3014 Document server/region/Lucene index start-up sequence

[eshu] GEODE-2892: Add sizeOnServer and isEmptyOnServer to Region

[lgallinat] GEODE-2661: afterDestroy events fired on non-existent keys during

[kmiller] GEODE-2947: Document revised gfsh destroy error message

[dbarnes] GEODE-1672: When amount of overflowed persisted data exceeds heap size

[dbarnes] GEODE-1672: When amount of overflowed persisted data exceeds heap size

[jiliao] GEODE-2981: Fix the line feed code of the test expected value

[jiliao] GEODE-3033: Fixing NPE when jarFileNames is null in

[dbarnes] GEODE-3044: User Manual: Update Swagger example and screen shots This

[boglesby] GEODE-3040: Compare gateway profile order policy against 9.0 instead of

[dbarnes] GEODE-3044: User Manual: Update Swagger example and screen shots -

[dbarnes] GEODE-2555: Region Management docs page refers to the wrong field (id=

[abaker] GEODE-194: Remove spark connector

[dbarnes] GEODE-3044: User Manual: Update Swagger example and screen shots -

[dschneider] GEODE-3027: add a simple PartitionResolver

[jstewart] GEODE-3032: Fix CI failure of CommandOverHttpDUnitTest

[dbarnes] GEODE-3029: Tomcat Install Documentation has incorrect required JARs

[jiliao] GEODE-2420: add file-size-limit param to the ExportLogsController

[klund] GEODE-2632: use immutable SecurityService impls to improve performance

[jiliao] GEODE-3054: escaping the escape character in the command string before

[klund] Revert "GEODE-2632: use immutable SecurityService impls to improve

[hkhamesra] Revert "GEODE-2804 Update InetSocketAddress, when there is IOException."

[nnag] GEODE-3025: Lucene queries are not allowed withing a transaction.

[dbarnes] GEODE-3044: User Manual: Update Swagger screen shots to match latest

[dbarnes] GEODE-2420: Warn a user if they try to export too much data, update gfsh

[kmiller] GEODE-3042: Quick doc of new string-based partition resolver

[huynhja] GEODE-3021: Any call after the first to setPdxStringFlag should no-op

[ukohlmeyer] GEODE-3065: Marking RedisServerTest.java as Flaky. Seemed to be failing

[dbarnes] Update geode-book README instructions

[abaker] GEODE-3023: TcpServer move soTimout for the socket for SSL Locators

[abaker] GEODE-3023: removing incorrect assertion

[abaker] Fix spotless failure

[jiliao] GEODE-2294: revert to avoid rest protocol change

[abaker] Update LICENSE after review

[abaker] GEODE-3024 race condition between server locator preparing membership

[abaker] GEODE-3024 race condition between server locator preparing membership

[eshu] GEODE-2301: Deprecate JTA transaction manager from Geode

[boglesby] GEODE-3072: Changed getMembershipId to use the client version

[abaker] Fix typo in dependency declaration from LICENSE review

[kmiller] GEODE-2301 Doc note to deprecate Geode JTA trans mgr

[boglesby] GEODE-3072: Ignore dunit test

[jiliao] GEODE-3092: fix specifiedDefaultValue for cacheLoader and cacheWriter

[jiliao] GEODE-3095: fix parameter type mismatch between the diskstore command

[jiliao] GEODE-3092: fix specifiedDefaultValue for cacheLoader and cacheWriter -

[bschuchardt] GEODE-3072: Events do not get removed from the client queue for 1.0

[bschuchardt] GEODE-3139 remove current artifacts from classpath of

[boglesby] GEODE-3152: Changed to create a region name appropriate to the client

[bschuchardt] Revert "GEODE-3139 remove current artifacts from classpath of

[bschuchardt] GEODE-3139 remove artifacts from classpath of backward-compatibility

[upthewaterspout] GEODE-3139: Fixing compilation errors

[bschuchardt] Revert "Revert "GEODE-3139 remove current artifacts from classpath of

[hkhamesra] GEODE-3153 Client receives duplicate events during rolling upgrade

[hkhamesra] GEODE-3153 applied spotless

[upthewaterspout] GEODE-3172: Fix serialization errors copying queue between 1.0 and 1.2

[bschuchardt] GEODE-3175 backward-compatibility tests fail with bad classpath

[abaker] bump version

[jstewart] GEODE-3313: Test utility supports building jar files with multiple

[jstewart] GEODE-3235: Deploy jar registers functions which extend FunctionAdapter

[abaker] GEODE-3393: One-way SSL commit failing with userHome/.keystore not

[abaker] GEODE-3314: Fix DLockService token leak.

[abaker] GEODE-3314 - Refactoring of DLockService to improve developer QoL. This

[abaker] GEODE-3410 Doc update for gfsh query command changes

[jstewart] GEODE-3217: Reimplement gfsh query as a single-step command

[bschuchardt] GEODE-3249: Validate internal client/server messages

[bschuchardt] GEODE-3249: internal messages should require credentials

[abaker] GEODE-3249 Document geode.allow-internal-messages-without-credentials

[bschuchardt] GEODE-3249 Validate internal client/server messages

[abaker] GEODE-3249 Revise docs for internal msg validation

[bschuchardt] GEODE-3249 Validate internal client/server messages

[github] GEODE-3629: Old versions will be pulled from the Apache Maven Repo

[khowe] GEODE-3590: Prevent NPE during scripted disconnect.

[khowe] Added test, ran spotless

------------------------------------------
[...truncated 107.53 KB...]
Download https://repo1.maven.org/maven2/io/springfox/springfox-swagger-ui/2.6.1/springfox-swagger-ui-2.6.1.jar
Download https://repo1.maven.org/maven2/org/springframework/hateoas/spring-hateoas/0.23.0.RELEASE/spring-hateoas-0.23.0.RELEASE.jar
Download https://repo1.maven.org/maven2/com/fasterxml/jackson/module/jackson-module-paranamer/2.8.6/jackson-module-paranamer-2.8.6.jar
Download https://repo1.maven.org/maven2/io/swagger/swagger-annotations/1.5.10/swagger-annotations-1.5.10.jar
Download https://repo1.maven.org/maven2/io/swagger/swagger-models/1.5.10/swagger-models-1.5.10.jar
Download https://repo1.maven.org/maven2/io/springfox/springfox-spi/2.6.1/springfox-spi-2.6.1.jar
Download https://repo1.maven.org/maven2/io/springfox/springfox-schema/2.6.1/springfox-schema-2.6.1.jar
Download https://repo1.maven.org/maven2/io/springfox/springfox-swagger-common/2.6.1/springfox-swagger-common-2.6.1.jar
Download https://repo1.maven.org/maven2/io/springfox/springfox-spring-web/2.6.1/springfox-spring-web-2.6.1.jar
Download https://repo1.maven.org/maven2/org/springframework/plugin/spring-plugin-core/1.2.0.RELEASE/spring-plugin-core-1.2.0.RELEASE.jar
Download https://repo1.maven.org/maven2/org/springframework/plugin/spring-plugin-metadata/1.2.0.RELEASE/spring-plugin-metadata-1.2.0.RELEASE.jar
Download https://repo1.maven.org/maven2/org/mapstruct/mapstruct/1.0.0.Final/mapstruct-1.0.0.Final.jar
Download https://repo1.maven.org/maven2/com/thoughtworks/paranamer/paranamer/2.8/paranamer-2.8.jar
Download https://repo1.maven.org/maven2/io/springfox/springfox-core/2.6.1/springfox-core-2.6.1.jar
Note: Some input files use unchecked or unsafe operations.
Note: Recompile with -Xlint:unchecked for details.
:geode-web-api:processResources
:geode-web-api:classes
:geode-assembly:docs<https://builds.apache.org/job/Geode-nightly-flaky/ws/geode-protobuf/src/main/java/org/apache/geode/protocol/protobuf/utilities/ProtobufUtilities.java>:101:
warning - Tag @link: reference not found: BasicTypes.Entry

1 warning
:geode-assembly:gfshDepsJar
:geode-common:javadocJar
:geode-common:sourcesJar
:geode-common:signArchives SKIPPED
:geode-core:javadocJar
:geode-core:raJar
:geode-core:jcaJar
:geode-core:sourcesJar
:geode-core:signArchives SKIPPED
:geode-core:webJar
:geode-cq:jar
:geode-cq:javadoc
:geode-cq:javadocJar
:geode-cq:sourcesJar
:geode-cq:signArchives SKIPPED
:geode-json:javadocJar
:geode-json:sourcesJar
:geode-json:signArchives SKIPPED
:geode-lucene:jar
:geode-lucene:javadoc
:geode-lucene:javadocJar
:geode-lucene:sourcesJar
:geode-lucene:signArchives SKIPPED
:geode-old-client-support:jar
:geode-old-client-support:javadoc
:geode-old-client-support:javadocJar
:geode-old-client-support:sourcesJar
:geode-old-client-support:signArchives SKIPPED
:geode-protobuf:jar
:geode-protobuf:javadoc<https://builds.apache.org/job/Geode-nightly-flaky/ws/geode-protobuf/src/main/java/org/apache/geode/protocol/protobuf/utilities/ProtobufUtilities.java>:101:
warning - Tag @link: reference not found: BasicTypes.Entry

1 warning
:geode-protobuf:javadocJar
:geode-protobuf:sourcesJar
:geode-protobuf:signArchives SKIPPED
:geode-pulse:javadoc
:geode-pulse:javadocJar
:geode-pulse:sourcesJar
:geode-pulse:war
:geode-pulse:signArchives SKIPPED
:geode-rebalancer:jar
:geode-rebalancer:javadoc
:geode-rebalancer:javadocJar
:geode-rebalancer:sourcesJar
:geode-rebalancer:signArchives SKIPPED
:geode-wan:jar
:geode-wan:javadoc
:geode-wan:javadocJar
:geode-wan:sourcesJar
:geode-wan:signArchives SKIPPED
:geode-web:javadoc NO-SOURCE
:geode-web:javadocJar
:geode-web:sourcesJar
:geode-web:war
:geode-web:signArchives SKIPPED
:geode-web-api:javadoc
:geode-web-api:javadocJar
:geode-web-api:sourcesJar
:geode-web-api:war
:geode-web-api:signArchives SKIPPED
:geode-assembly:installDist
:geode-pulse:jar
:geode-assembly:compileTestJava
Download https://repo1.maven.org/maven2/org/codehaus/cargo/cargo-core-uberjar/1.6.3/cargo-core-uberjar-1.6.3.pom
Download https://repo1.maven.org/maven2/org/codehaus/cargo/cargo-core/1.6.3/cargo-core-1.6.3.pom
Download https://repo1.maven.org/maven2/org/codehaus/cargo/codehaus-cargo/1.6.3/codehaus-cargo-1.6.3.pom
Download https://repo1.maven.org/maven2/org/codehaus/cargo/cargo-core-uberjar/1.6.3/cargo-core-uberjar-1.6.3.jar
Note: Some input files use or override a deprecated API.
Note: Recompile with -Xlint:deprecation for details.
Note: Some input files use unchecked or unsafe operations.
Note: Recompile with -Xlint:unchecked for details.
:geode-assembly:processTestResources
:geode-assembly:testClasses
:geode-assembly:flakyTest
:geode-benchmarks:compileTestJava NO-SOURCE
:geode-benchmarks:processTestResources NO-SOURCE
:geode-benchmarks:testClasses UP-TO-DATE
:geode-benchmarks:flakyTest NO-SOURCE
:geode-common:compileTestJava
:geode-common:processTestResources NO-SOURCE
:geode-common:testClasses
:geode-common:flakyTest
:geode-core:flakyTest

org.apache.geode.management.internal.cli.commands.FunctionCommandsDUnitTest > testExecuteFunctionOnRegionBug51480
FAILED
    java.lang.AssertionError: Execution of connect --jmx-manager=pietas.apache.org[24484]
failed to connect to manager pietas.apache.org[24484] result=Could not connect to : [host=pietas.apache.org,
port=24484]. Failed to retrieve RMIServer stub: javax.naming.CommunicationException [Root
exception is java.rmi.NoSuchObjectException: no such object in table]
        at org.apache.geode.management.internal.cli.commands.CliCommandTestBase.connect(CliCommandTestBase.java:272)
        at org.apache.geode.management.internal.cli.commands.CliCommandTestBase.connect(CliCommandTestBase.java:244)
        at org.apache.geode.management.internal.cli.commands.CliCommandTestBase.setUpJmxManagerOnVm0ThenConnect(CliCommandTestBase.java:145)
        at org.apache.geode.management.internal.cli.commands.FunctionCommandsDUnitTest.setupForBug51480(FunctionCommandsDUnitTest.java:208)
        at org.apache.geode.management.internal.cli.commands.FunctionCommandsDUnitTest.testExecuteFunctionOnRegionBug51480(FunctionCommandsDUnitTest.java:258)

338 tests completed, 1 failed, 9 skipped
:geode-core:flakyTest FAILED
:geode-cq:compileTestJavaNote: Some input files use or override a deprecated API.
Note: Recompile with -Xlint:deprecation for details.
Note: Some input files use unchecked or unsafe operations.
Note: Recompile with -Xlint:unchecked for details.

:geode-cq:processTestResources
:geode-cq:testClasses
:geode-cq:flakyTest
:geode-json:compileTestJava NO-SOURCE
:geode-json:processTestResources
:geode-json:testClasses
:geode-json:flakyTest NO-SOURCE
:geode-junit:compileTestJavaNote: <https://builds.apache.org/job/Geode-nightly-flaky/ws/geode-junit/src/test/java/org/apache/geode/test/compiler/JarBuilderTest.java>
uses or overrides a deprecated API.
Note: Recompile with -Xlint:deprecation for details.
Note: <https://builds.apache.org/job/Geode-nightly-flaky/ws/geode-junit/src/test/java/org/apache/geode/test/compiler/ClassNameExtractorTest.java>
uses unchecked or unsafe operations.
Note: Recompile with -Xlint:unchecked for details.

:geode-junit:processTestResources
:geode-junit:testClasses
:geode-junit:flakyTest
:geode-lucene:compileTestJava
Download https://repo1.maven.org/maven2/org/apache/lucene/lucene-test-framework/6.4.1/lucene-test-framework-6.4.1.pom
Download https://repo1.maven.org/maven2/org/apache/lucene/lucene-codecs/6.4.1/lucene-codecs-6.4.1.pom
Download https://repo1.maven.org/maven2/com/carrotsearch/randomizedtesting/randomizedtesting-runner/2.4.0/randomizedtesting-runner-2.4.0.pom
Download https://repo1.maven.org/maven2/com/carrotsearch/randomizedtesting/randomizedtesting-parent/2.4.0/randomizedtesting-parent-2.4.0.pom
Download https://repo1.maven.org/maven2/org/apache/lucene/lucene-test-framework/6.4.1/lucene-test-framework-6.4.1.jar
Download https://repo1.maven.org/maven2/org/apache/lucene/lucene-codecs/6.4.1/lucene-codecs-6.4.1.jar
Download https://repo1.maven.org/maven2/com/carrotsearch/randomizedtesting/randomizedtesting-runner/2.4.0/randomizedtesting-runner-2.4.0.jar
Note: Some input files use or override a deprecated API.
Note: Recompile with -Xlint:deprecation for details.
Note: Some input files use unchecked or unsafe operations.
Note: Recompile with -Xlint:unchecked for details.
:geode-lucene:processTestResources
:geode-lucene:testClasses
:geode-lucene:flakyTest
:geode-old-client-support:compileTestJavaNote: <https://builds.apache.org/job/Geode-nightly-flaky/ws/geode-old-client-support/src/test/java/com/gemstone/gemfire/cache/execute/FunctionExceptionTest.java>
uses or overrides a deprecated API.
Note: Recompile with -Xlint:deprecation for details.

:geode-old-client-support:processTestResources NO-SOURCE
:geode-old-client-support:testClasses
:geode-old-client-support:flakyTest
:geode-old-versions:compileTestJava NO-SOURCE
:geode-old-versions:processTestResources NO-SOURCE
:geode-old-versions:testClasses UP-TO-DATE
:geode-old-versions:flakyTest NO-SOURCE
:geode-protobuf:extractIncludeTestProto
Download https://repo1.maven.org/maven2/org/powermock/powermock-api-mockito/1.7.0RC4/powermock-api-mockito-1.7.0RC4.pom
Download https://repo1.maven.org/maven2/org/powermock/powermock-api-mockito/1.7.0RC4/powermock-api-mockito-1.7.0RC4.jar
:geode-protobuf:extractTestProto
:geode-protobuf:generateTestProto NO-SOURCE
:geode-protobuf:compileTestJavaNote: <https://builds.apache.org/job/Geode-nightly-flaky/ws/geode-protobuf/src/test/java/org/apache/geode/protocol/acceptance/CacheMaxConnectionJUnitTest.java>
uses or overrides a deprecated API.
Note: Recompile with -Xlint:deprecation for details.
Note: Some input files use unchecked or unsafe operations.
Note: Recompile with -Xlint:unchecked for details.

:geode-protobuf:processTestResources
:geode-protobuf:testClasses
:geode-protobuf:flakyTest
:geode-pulse:compileTestJava
Download https://repo1.maven.org/maven2/com/codeborne/phantomjsdriver/1.3.0/phantomjsdriver-1.3.0.pom
Download https://repo1.maven.org/maven2/com/codeborne/phantomjsdriver/1.3.0/phantomjsdriver-1.3.0.jar
Download https://repo1.maven.org/maven2/org/seleniumhq/selenium/selenium-api/3.0.1/selenium-api-3.0.1.jar
Download https://repo1.maven.org/maven2/org/seleniumhq/selenium/selenium-remote-driver/3.0.1/selenium-remote-driver-3.0.1.jar
Download https://repo1.maven.org/maven2/org/seleniumhq/selenium/selenium-support/3.0.1/selenium-support-3.0.1.jar
Note: Some input files use or override a deprecated API.
Note: Recompile with -Xlint:deprecation for details.
Note: <https://builds.apache.org/job/Geode-nightly-flaky/ws/geode-pulse/src/test/java/org/apache/geode/tools/pulse/controllers/PulseControllerJUnitTest.java>
uses unchecked or unsafe operations.
Note: Recompile with -Xlint:unchecked for details.
:geode-pulse:processTestResources
:geode-pulse:testClasses
:geode-pulse:flakyTest
:geode-rebalancer:compileTestJava
:geode-rebalancer:processTestResources NO-SOURCE
:geode-rebalancer:testClasses
:geode-rebalancer:flakyTest
:geode-wan:compileTestJavaNote: Some input files use or override a deprecated API.
Note: Recompile with -Xlint:deprecation for details.
Note: Some input files use unchecked or unsafe operations.
Note: Recompile with -Xlint:unchecked for details.

:geode-wan:processTestResources
:geode-wan:testClasses
:geode-wan:flakyTest
:geode-web:compileTestJavaNote: Some input files use or override a deprecated API.
Note: Recompile with -Xlint:deprecation for details.

:geode-web:processTestResources NO-SOURCE
:geode-web:testClasses
:geode-web:flakyTest

org.apache.geode.management.internal.cli.commands.CommandOverHttpDUnitTest > org.apache.geode.management.internal.cli.commands.MiscellaneousCommandsDUnitTest.testShutDownWithoutTimeout@org.apache.geode.management.internal.cli.commands.CommandOverHttpDUnitTest
FAILED
    java.lang.AssertionError: Event never occurred after 1000 ms: Waits for the shell to disconnect!
        at org.junit.Assert.fail(Assert.java:88)
        at org.apache.geode.test.dunit.Wait.waitForCriterion(Wait.java:190)
        at org.apache.geode.management.internal.cli.commands.MiscellaneousCommandsDUnitTest.testShutDownWithoutTimeout(MiscellaneousCommandsDUnitTest.java:254)

97 tests completed, 1 failed, 1 skipped
:geode-web:flakyTest FAILED
:geode-web-api:compileTestJava
:geode-web-api:processTestResources NO-SOURCE
:geode-web-api:testClasses
:geode-web-api:flakyTest
:combineReports
All test reports at <https://builds.apache.org/job/Geode-nightly-flaky/ws/build/reports/combined>

FAILURE: Build completed with 2 failures.

1: Task failed with an exception.
-----------
* What went wrong:
Execution failed for task ':geode-core:flakyTest'.
> There were failing tests. See the report at: file://<https://builds.apache.org/job/Geode-nightly-flaky/ws/geode-core/build/reports/flakyTest/index.html>

* Try:
Run with --stacktrace option to get the stack trace. Run with --info or --debug option to
get more log output.
==============================================================================

2: Task failed with an exception.
-----------
* What went wrong:
Execution failed for task ':geode-web:flakyTest'.
> There were failing tests. See the report at: file://<https://builds.apache.org/job/Geode-nightly-flaky/ws/geode-web/build/reports/flakyTest/index.html>

* Try:
Run with --stacktrace option to get the stack trace. Run with --info or --debug option to
get more log output.
==============================================================================

BUILD FAILED

Total time: 2 hrs 5 mins 32.036 secs
Build step 'Invoke Gradle script' changed build result to FAILURE
Build step 'Invoke Gradle script' marked build as failure
Archiving artifacts
Recording test results

Mime
View raw message