geode-dev mailing list archives

Site index · List index
Message view « Date » · « Thread »
Top « Date » · « Thread »
From Apache Jenkins Server <jenk...@builds.apache.org>
Subject Build failed in Jenkins: Geode-nightly #926
Date Fri, 18 Aug 2017 04:04:38 GMT
See <https://builds.apache.org/job/Geode-nightly/926/display/redirect?page=changes>

Changes:

[bschuchardt] GEODE-3249: Validate internal client/server messages

[eshu] GEODE-3444: Release the locks held when beforeCompletion failed with

[dbarnes] GEODE-3395 Variable-ize product version and name in user guide - REST

[bschuchardt] GEODE-3427 CI failure in

[gzhou] GEODE-3055: change the error message's log level from info to debug.

------------------------------------------
[...truncated 86.87 KB...]
        at org.apache.geode.test.dunit.rules.gfsh.GfshScript.awaitIfNecessary(GfshScript.java:112)
        at org.apache.geode.test.dunit.rules.gfsh.GfshRule.execute(GfshRule.java:65)
        at org.apache.geode.test.dunit.rules.gfsh.GfshScript.execute(GfshScript.java:105)
        at org.apache.geode.management.internal.cli.shell.GfshExitCodeStatusCommandsTest$TestConfiguration.startNecessaryMembers(GfshExitCodeStatusCommandsTest.java:384)
        at org.apache.geode.management.internal.cli.shell.GfshExitCodeStatusCommandsTest.onlineStatusCommandShouldFailWhenNotConnected_locator_name(GfshExitCodeStatusCommandsTest.java:109)

org.apache.geode.management.internal.cli.shell.GfshExitCodeStatusCommandsTest > offlineStatusCommandShouldSucceedWhenConnected_locator_dir
FAILED
    org.junit.ComparisonFailure: expected:<[tru]e> but was:<[fals]e>
        at sun.reflect.NativeConstructorAccessorImpl.newInstance0(Native Method)
        at sun.reflect.NativeConstructorAccessorImpl.newInstance(NativeConstructorAccessorImpl.java:62)
        at sun.reflect.DelegatingConstructorAccessorImpl.newInstance(DelegatingConstructorAccessorImpl.java:45)
        at org.apache.geode.test.dunit.rules.gfsh.GfshScript.awaitLoudly(GfshScript.java:133)
        at org.apache.geode.test.dunit.rules.gfsh.GfshScript.awaitIfNecessary(GfshScript.java:112)
        at org.apache.geode.test.dunit.rules.gfsh.GfshRule.execute(GfshRule.java:65)
        at org.apache.geode.test.dunit.rules.gfsh.GfshScript.execute(GfshScript.java:105)
        at org.apache.geode.management.internal.cli.shell.GfshExitCodeStatusCommandsTest$TestConfiguration.startNecessaryMembers(GfshExitCodeStatusCommandsTest.java:384)
        at org.apache.geode.management.internal.cli.shell.GfshExitCodeStatusCommandsTest.offlineStatusCommandShouldSucceedWhenConnected_locator_dir(GfshExitCodeStatusCommandsTest.java:190)

org.apache.geode.management.internal.cli.shell.GfshExitCodeStatusCommandsTest > offlineStatusCommandShouldSucceedWhenConnected_locator_pid
FAILED
    org.junit.ComparisonFailure: expected:<[tru]e> but was:<[fals]e>
        at sun.reflect.NativeConstructorAccessorImpl.newInstance0(Native Method)
        at sun.reflect.NativeConstructorAccessorImpl.newInstance(NativeConstructorAccessorImpl.java:62)
        at sun.reflect.DelegatingConstructorAccessorImpl.newInstance(DelegatingConstructorAccessorImpl.java:45)
        at org.apache.geode.test.dunit.rules.gfsh.GfshScript.awaitLoudly(GfshScript.java:133)
        at org.apache.geode.test.dunit.rules.gfsh.GfshScript.awaitIfNecessary(GfshScript.java:112)
        at org.apache.geode.test.dunit.rules.gfsh.GfshRule.execute(GfshRule.java:65)
        at org.apache.geode.test.dunit.rules.gfsh.GfshScript.execute(GfshScript.java:105)
        at org.apache.geode.management.internal.cli.shell.GfshExitCodeStatusCommandsTest$TestConfiguration.startNecessaryMembers(GfshExitCodeStatusCommandsTest.java:384)
        at org.apache.geode.management.internal.cli.shell.GfshExitCodeStatusCommandsTest.offlineStatusCommandShouldSucceedWhenConnected_locator_pid(GfshExitCodeStatusCommandsTest.java:209)

org.apache.geode.management.internal.cli.shell.GfshExitCodeStatusCommandsTest > offlineStatusCommandShouldSucceedWhenNotConnected_locator_host_and_port
FAILED
    org.junit.ComparisonFailure: expected:<[tru]e> but was:<[fals]e>
        at sun.reflect.NativeConstructorAccessorImpl.newInstance0(Native Method)
        at sun.reflect.NativeConstructorAccessorImpl.newInstance(NativeConstructorAccessorImpl.java:62)
        at sun.reflect.DelegatingConstructorAccessorImpl.newInstance(DelegatingConstructorAccessorImpl.java:45)
        at org.apache.geode.test.dunit.rules.gfsh.GfshScript.awaitLoudly(GfshScript.java:133)
        at org.apache.geode.test.dunit.rules.gfsh.GfshScript.awaitIfNecessary(GfshScript.java:112)
        at org.apache.geode.test.dunit.rules.gfsh.GfshRule.execute(GfshRule.java:65)
        at org.apache.geode.test.dunit.rules.gfsh.GfshScript.execute(GfshScript.java:105)
        at org.apache.geode.management.internal.cli.shell.GfshExitCodeStatusCommandsTest$TestConfiguration.startNecessaryMembers(GfshExitCodeStatusCommandsTest.java:384)
        at org.apache.geode.management.internal.cli.shell.GfshExitCodeStatusCommandsTest.offlineStatusCommandShouldSucceedWhenNotConnected_locator_host_and_port(GfshExitCodeStatusCommandsTest.java:140)

org.apache.geode.management.internal.cli.shell.GfshExitCodeStatusCommandsTest > onlineStatusCommandShouldSucceedWhenConnected_locator_name
FAILED
    org.junit.ComparisonFailure: expected:<[tru]e> but was:<[fals]e>
        at sun.reflect.NativeConstructorAccessorImpl.newInstance0(Native Method)
        at sun.reflect.NativeConstructorAccessorImpl.newInstance(NativeConstructorAccessorImpl.java:62)
        at sun.reflect.DelegatingConstructorAccessorImpl.newInstance(DelegatingConstructorAccessorImpl.java:45)
        at org.apache.geode.test.dunit.rules.gfsh.GfshScript.awaitLoudly(GfshScript.java:133)
        at org.apache.geode.test.dunit.rules.gfsh.GfshScript.awaitIfNecessary(GfshScript.java:112)
        at org.apache.geode.test.dunit.rules.gfsh.GfshRule.execute(GfshRule.java:65)
        at org.apache.geode.test.dunit.rules.gfsh.GfshScript.execute(GfshScript.java:105)
        at org.apache.geode.management.internal.cli.shell.GfshExitCodeStatusCommandsTest$TestConfiguration.startNecessaryMembers(GfshExitCodeStatusCommandsTest.java:384)
        at org.apache.geode.management.internal.cli.shell.GfshExitCodeStatusCommandsTest.onlineStatusCommandShouldSucceedWhenConnected_locator_name(GfshExitCodeStatusCommandsTest.java:151)

org.apache.geode.management.internal.cli.shell.GfshExitCodeStatusCommandsTest > onlineStatusCommandShouldSucceedWhenConnected_locator_port
FAILED
    org.junit.ComparisonFailure: expected:<[tru]e> but was:<[fals]e>
        at sun.reflect.NativeConstructorAccessorImpl.newInstance0(Native Method)
        at sun.reflect.NativeConstructorAccessorImpl.newInstance(NativeConstructorAccessorImpl.java:62)
        at sun.reflect.DelegatingConstructorAccessorImpl.newInstance(DelegatingConstructorAccessorImpl.java:45)
        at org.apache.geode.test.dunit.rules.gfsh.GfshScript.awaitLoudly(GfshScript.java:133)
        at org.apache.geode.test.dunit.rules.gfsh.GfshScript.awaitIfNecessary(GfshScript.java:112)
        at org.apache.geode.test.dunit.rules.gfsh.GfshRule.execute(GfshRule.java:65)
        at org.apache.geode.test.dunit.rules.gfsh.GfshScript.execute(GfshScript.java:105)
        at org.apache.geode.management.internal.cli.shell.GfshExitCodeStatusCommandsTest$TestConfiguration.startNecessaryMembers(GfshExitCodeStatusCommandsTest.java:384)
        at org.apache.geode.management.internal.cli.shell.GfshExitCodeStatusCommandsTest.onlineStatusCommandShouldSucceedWhenConnected_locator_port(GfshExitCodeStatusCommandsTest.java:170)

org.apache.geode.management.internal.cli.shell.GfshExitCodeStatusCommandsTest > offlineStatusCommandShouldSucceedEvenWhenNotConnected_locator_dir
FAILED
    org.junit.ComparisonFailure: expected:<[tru]e> but was:<[fals]e>
        at sun.reflect.NativeConstructorAccessorImpl.newInstance0(Native Method)
        at sun.reflect.NativeConstructorAccessorImpl.newInstance(NativeConstructorAccessorImpl.java:62)
        at sun.reflect.DelegatingConstructorAccessorImpl.newInstance(DelegatingConstructorAccessorImpl.java:45)
        at org.apache.geode.test.dunit.rules.gfsh.GfshScript.awaitLoudly(GfshScript.java:133)
        at org.apache.geode.test.dunit.rules.gfsh.GfshScript.awaitIfNecessary(GfshScript.java:112)
        at org.apache.geode.test.dunit.rules.gfsh.GfshRule.execute(GfshRule.java:65)
        at org.apache.geode.test.dunit.rules.gfsh.GfshScript.execute(GfshScript.java:105)
        at org.apache.geode.management.internal.cli.shell.GfshExitCodeStatusCommandsTest$TestConfiguration.startNecessaryMembers(GfshExitCodeStatusCommandsTest.java:384)
        at org.apache.geode.management.internal.cli.shell.GfshExitCodeStatusCommandsTest.offlineStatusCommandShouldSucceedEvenWhenNotConnected_locator_dir(GfshExitCodeStatusCommandsTest.java:230)

org.apache.geode.management.internal.cli.shell.GfshExitCodeStatusCommandsTest > offlineStatusCommandShouldSucceedEvenWhenNotConnected_locator_pid
FAILED
    org.junit.ComparisonFailure: expected:<[tru]e> but was:<[fals]e>
        at sun.reflect.NativeConstructorAccessorImpl.newInstance0(Native Method)
        at sun.reflect.NativeConstructorAccessorImpl.newInstance(NativeConstructorAccessorImpl.java:62)
        at sun.reflect.DelegatingConstructorAccessorImpl.newInstance(DelegatingConstructorAccessorImpl.java:45)
        at org.apache.geode.test.dunit.rules.gfsh.GfshScript.awaitLoudly(GfshScript.java:133)
        at org.apache.geode.test.dunit.rules.gfsh.GfshScript.awaitIfNecessary(GfshScript.java:112)
        at org.apache.geode.test.dunit.rules.gfsh.GfshRule.execute(GfshRule.java:65)
        at org.apache.geode.test.dunit.rules.gfsh.GfshScript.execute(GfshScript.java:105)
        at org.apache.geode.management.internal.cli.shell.GfshExitCodeStatusCommandsTest$TestConfiguration.startNecessaryMembers(GfshExitCodeStatusCommandsTest.java:384)
        at org.apache.geode.management.internal.cli.shell.GfshExitCodeStatusCommandsTest.offlineStatusCommandShouldSucceedEvenWhenNotConnected_locator_pid(GfshExitCodeStatusCommandsTest.java:250)

org.apache.geode.management.internal.cli.commands.StatusLocatorRealGfshTest > statusLocatorSucceedsWhenConnected
FAILED
    org.junit.ComparisonFailure: expected:<[tru]e> but was:<[fals]e>
        at sun.reflect.NativeConstructorAccessorImpl.newInstance0(Native Method)
        at sun.reflect.NativeConstructorAccessorImpl.newInstance(NativeConstructorAccessorImpl.java:62)
        at sun.reflect.DelegatingConstructorAccessorImpl.newInstance(DelegatingConstructorAccessorImpl.java:45)
        at org.apache.geode.test.dunit.rules.gfsh.GfshScript.awaitLoudly(GfshScript.java:133)
        at org.apache.geode.test.dunit.rules.gfsh.GfshScript.awaitIfNecessary(GfshScript.java:112)
        at org.apache.geode.test.dunit.rules.gfsh.GfshRule.execute(GfshRule.java:65)
        at org.apache.geode.test.dunit.rules.gfsh.GfshScript.execute(GfshScript.java:105)
        at org.apache.geode.management.internal.cli.commands.StatusLocatorRealGfshTest.statusLocatorSucceedsWhenConnected(StatusLocatorRealGfshTest.java:32)

org.apache.geode.management.internal.cli.commands.StatusLocatorRealGfshTest > statusLocatorFailsWhenNotConnected
FAILED
    org.junit.ComparisonFailure: expected:<[tru]e> but was:<[fals]e>
        at sun.reflect.NativeConstructorAccessorImpl.newInstance0(Native Method)
        at sun.reflect.NativeConstructorAccessorImpl.newInstance(NativeConstructorAccessorImpl.java:62)
        at sun.reflect.DelegatingConstructorAccessorImpl.newInstance(DelegatingConstructorAccessorImpl.java:45)
        at org.apache.geode.test.dunit.rules.gfsh.GfshScript.awaitLoudly(GfshScript.java:133)
        at org.apache.geode.test.dunit.rules.gfsh.GfshScript.awaitIfNecessary(GfshScript.java:112)
        at org.apache.geode.test.dunit.rules.gfsh.GfshRule.execute(GfshRule.java:65)
        at org.apache.geode.test.dunit.rules.gfsh.GfshScript.execute(GfshScript.java:105)
        at org.apache.geode.management.internal.cli.commands.StatusLocatorRealGfshTest.statusLocatorFailsWhenNotConnected(StatusLocatorRealGfshTest.java:39)

29 tests completed, 18 failed
:geode-assembly:acceptanceTest FAILED
:extensions/geode-modules-assembly:jar
:extensions/geode-modules-assembly:signArchives SKIPPED
:extensions/geode-modules-assembly:assemble
:extensions/geode-modules-assembly:compileTestJava UP-TO-DATE
:extensions/geode-modules-assembly:processTestResources UP-TO-DATE
:extensions/geode-modules-assembly:testClasses UP-TO-DATE
:extensions/geode-modules-assembly:checkMissedTests UP-TO-DATE
:extensions/geode-modules-assembly:spotlessJavaCheck
:extensions/geode-modules-assembly:spotlessCheck
:extensions/geode-modules-assembly:test UP-TO-DATE
:extensions/geode-modules-assembly:check
:extensions/geode-modules-assembly:build
:extensions/geode-modules-assembly:distributedTest UP-TO-DATE
:extensions/geode-modules-assembly:integrationTest UP-TO-DATE
:extensions/geode-modules-session:compileTestJavaNote: <https://builds.apache.org/job/Geode-nightly/ws/extensions/geode-modules-session/src/test/java/org/apache/geode/modules/session/installer/InstallerJUnitTest.java>
uses or overrides a deprecated API.
Note: Recompile with -Xlint:deprecation for details.

:extensions/geode-modules-session:processTestResources
:extensions/geode-modules-session:testClasses
:extensions/geode-modules-session:checkMissedTests
:extensions/geode-modules-session:spotlessJavaCheck
:extensions/geode-modules-session:spotlessCheck
:extensions/geode-modules-session:test
:extensions/geode-modules-session:check
:extensions/geode-modules-session:build
:extensions/geode-modules-session:distributedTest
:extensions/geode-modules-session:integrationTest
:extensions/geode-modules-session-internal:javadocJar
:extensions/geode-modules-session-internal:sourcesJar
:extensions/geode-modules-session-internal:signArchives SKIPPED
:extensions/geode-modules-session-internal:assemble
:extensions/geode-modules-session-internal:compileTestJava UP-TO-DATE
:extensions/geode-modules-session-internal:processTestResources UP-TO-DATE
:extensions/geode-modules-session-internal:testClasses UP-TO-DATE
:extensions/geode-modules-session-internal:checkMissedTests UP-TO-DATE
:extensions/geode-modules-session-internal:spotlessJavaCheck
:extensions/geode-modules-session-internal:spotlessCheck
:extensions/geode-modules-session-internal:test UP-TO-DATE
:extensions/geode-modules-session-internal:check
:extensions/geode-modules-session-internal:build
:extensions/geode-modules-session-internal:distributedTest UP-TO-DATE
:extensions/geode-modules-session-internal:integrationTest UP-TO-DATE
:extensions/geode-modules-tomcat7:compileTestJava
:extensions/geode-modules-tomcat7:processTestResources
:extensions/geode-modules-tomcat7:testClasses
:extensions/geode-modules-tomcat7:checkMissedTests
:extensions/geode-modules-tomcat7:spotlessJavaCheck
:extensions/geode-modules-tomcat7:spotlessCheck
:extensions/geode-modules-tomcat7:test
:extensions/geode-modules-tomcat7:check
:extensions/geode-modules-tomcat7:build
:extensions/geode-modules-tomcat7:distributedTest
:extensions/geode-modules-tomcat7:integrationTest
:extensions/geode-modules-tomcat8:compileTestJavaNote: <https://builds.apache.org/job/Geode-nightly/ws/extensions/geode-modules-tomcat8/src/test/java/org/apache/geode/modules/session/EmbeddedTomcat8.java>
uses or overrides a deprecated API.
Note: Recompile with -Xlint:deprecation for details.

:extensions/geode-modules-tomcat8:processTestResources
:extensions/geode-modules-tomcat8:testClasses
:extensions/geode-modules-tomcat8:checkMissedTests
:extensions/geode-modules-tomcat8:spotlessJavaCheck
:extensions/geode-modules-tomcat8:spotlessCheck
:extensions/geode-modules-tomcat8:test
:extensions/geode-modules-tomcat8:check
:extensions/geode-modules-tomcat8:build
:extensions/geode-modules-tomcat8:distributedTest
:extensions/geode-modules-tomcat8:integrationTest
:extensions/session-testing-war:javadoc
:extensions/session-testing-war:javadocJar
:extensions/session-testing-war:sourcesJar
:extensions/session-testing-war:war
:extensions/session-testing-war:signArchives SKIPPED
:extensions/session-testing-war:assemble
:extensions/session-testing-war:compileTestJava UP-TO-DATE
:extensions/session-testing-war:processTestResources UP-TO-DATE
:extensions/session-testing-war:testClasses UP-TO-DATE
:extensions/session-testing-war:checkMissedTests UP-TO-DATE
:extensions/session-testing-war:spotlessJavaCheck
:extensions/session-testing-war:spotlessCheck
:extensions/session-testing-war:test UP-TO-DATE
:extensions/session-testing-war:check
:extensions/session-testing-war:build
:extensions/session-testing-war:distributedTest UP-TO-DATE
:extensions/session-testing-war:integrationTest UP-TO-DATE
:geode-assembly:distTar
:geode-assembly:distZip
:geode-assembly:writeBuildInfo
:geode-assembly:srcDistTar
:geode-assembly:srcDistZip
:geode-assembly:signArchives SKIPPED
:geode-assembly:assemble
:geode-assembly:checkMissedTests
:geode-assembly:spotlessJavaCheck
:geode-assembly:spotlessCheck
:geode-assembly:test
:geode-assembly:check
:geode-assembly:build
:geode-assembly:distributedTest

org.apache.geode.management.internal.cli.commands.GfshStartLocatorLogTest > bannerOnlyLogsOnce
FAILED
    org.junit.ComparisonFailure: expected:<[tru]e> but was:<[fals]e>
        at sun.reflect.NativeConstructorAccessorImpl.newInstance0(Native Method)
        at sun.reflect.NativeConstructorAccessorImpl.newInstance(NativeConstructorAccessorImpl.java:62)
        at sun.reflect.DelegatingConstructorAccessorImpl.newInstance(DelegatingConstructorAccessorImpl.java:45)
        at org.apache.geode.test.dunit.rules.gfsh.GfshScript.awaitLoudly(GfshScript.java:133)
        at org.apache.geode.test.dunit.rules.gfsh.GfshScript.awaitIfNecessary(GfshScript.java:112)
        at org.apache.geode.test.dunit.rules.gfsh.GfshRule.execute(GfshRule.java:65)
        at org.apache.geode.test.dunit.rules.gfsh.GfshScript.execute(GfshScript.java:105)
        at org.apache.geode.management.internal.cli.commands.GfshStartLocatorLogTest.getExecutionLogs(GfshStartLocatorLogTest.java:56)
        at org.apache.geode.management.internal.cli.commands.GfshStartLocatorLogTest.bannerOnlyLogsOnce(GfshStartLocatorLogTest.java:44)

org.apache.geode.management.internal.cli.commands.GfshStartLocatorLogTest > startupConfigsOnlyLogsOnce
FAILED
    org.junit.ComparisonFailure: expected:<[tru]e> but was:<[fals]e>
        at sun.reflect.NativeConstructorAccessorImpl.newInstance0(Native Method)
        at sun.reflect.NativeConstructorAccessorImpl.newInstance(NativeConstructorAccessorImpl.java:62)
        at sun.reflect.DelegatingConstructorAccessorImpl.newInstance(DelegatingConstructorAccessorImpl.java:45)
        at org.apache.geode.test.dunit.rules.gfsh.GfshScript.awaitLoudly(GfshScript.java:133)
        at org.apache.geode.test.dunit.rules.gfsh.GfshScript.awaitIfNecessary(GfshScript.java:112)
        at org.apache.geode.test.dunit.rules.gfsh.GfshRule.execute(GfshRule.java:65)
        at org.apache.geode.test.dunit.rules.gfsh.GfshScript.execute(GfshScript.java:105)
        at org.apache.geode.management.internal.cli.commands.GfshStartLocatorLogTest.getExecutionLogs(GfshStartLocatorLogTest.java:56)
        at org.apache.geode.management.internal.cli.commands.GfshStartLocatorLogTest.startupConfigsOnlyLogsOnce(GfshStartLocatorLogTest.java:51)
Build timed out (after 1,440 minutes). Marking the build as failed.
Build was aborted
Archiving artifacts
[Fast Archiver] Compressed 339.43 MB of artifacts by 36.8% relative to #914
Recording test results
Not sending mail to unregistered user ukohlmeyer@pivotal.io
Not sending mail to unregistered user gzhou@pivotal.io
Not sending mail to unregistered user sjewll@pivotal.io
Not sending mail to unregistered user lhughesgodfrey@pivotal.io
Not sending mail to unregistered user jdeppe@gopivotal.com
Not sending mail to unregistered user eshu@pivotal.io
Not sending mail to unregistered user huynhja@gmail.com
Not sending mail to unregistered user hkhamesra@pivotal.io
Not sending mail to unregistered user jiliao@pivotal.io

Mime
View raw message